x

Search in
Sort by:

Question Status:

Search help

  • Simple searches use one or more words. Separate the words with spaces (cat dog) to search cat,dog or both. Separate the words with plus signs (cat +dog) to search for items that may contain cat but must contain dog.
  • You can further refine your search on the search results page, where you can search by keywords, author, topic. These can be combined with each other. Examples
    • cat dog --matches anything with cat,dog or both
    • cat +dog --searches for cat +dog where dog is a mandatory term
    • cat -dog -- searches for cat excluding any result containing dog
    • [cats] —will restrict your search to results with topic named "cats"
    • [cats] [dogs] —will restrict your search to results with both topics, "cats", and "dogs"

Android packaging failed

Hi, I would try to package my Android project and receive below error. I have installed TADP 2.0r8 following this manual: https://docs.unrealengine.com/latest/INT/Platforms/Android/GettingStarted/1/index.html Please help me. I also attached full log.

 MainFrameActions: Packaging (Android (ATC)): UnrealBuildTool: Compiling Native code with NDK API 'android-19'
 MainFrameActions: Packaging (Android (ATC)): UnrealBuildTool: Performing 1 actions (4 in parallel)
 MainFrameActions: Packaging (Android (ATC)): UnrealBuildTool: [1/1] clang++.exe ChasingRobbers-Android-Shipping-armv7-es2.so
 MainFrameActions: Packaging (Android (ATC)): UnrealBuildTool: D:/NVPACK/android-ndk-r9c/toolchains/arm-linux-androideabi-4.8/prebuilt/windows/lib/gcc/arm-linux-androideabi/4.8/../../../../arm-linux-androideabi/bin/ld.exe: error: cannot find -lcxa_demangle
 MainFrameActions: Packaging (Android (ATC)): UnrealBuildTool: D:/NVPACK/android-ndk-r9c/toolchains/arm-linux-androideabi-4.8/prebuilt/windows/lib/gcc/arm-linux-androideabi/4.8/../../../../arm-linux-androideabi/bin/ld.exe: error: cannot find -lnvToolsExt
 MainFrameActions: Packaging (Android (ATC)): UnrealBuildTool: D:/NVPACK/android-ndk-r9c/toolchains/arm-linux-androideabi-4.8/prebuilt/windows/lib/gcc/arm-linux-androideabi/4.8/../../../../arm-linux-androideabi/bin/ld.exe: error: cannot find -lLowLevelPROFILE
 MainFrameActions: Packaging (Android (ATC)): UnrealBuildTool: D:/NVPACK/android-ndk-r9c/toolchains/arm-linux-androideabi-4.8/prebuilt/windows/lib/gcc/arm-linux-androideabi/4.8/../../../../arm-linux-androideabi/bin/ld.exe: error: cannot find -lLowLevelClothPROFILE
 MainFrameActions: Packaging (Android (ATC)): UnrealBuildTool: D:/NVPACK/android-ndk-r9c/toolchains/arm-linux-androideabi-4.8/prebuilt/windows/lib/gcc/arm-linux-androideabi/4.8/../../../../arm-linux-androideabi/bin/ld.exe: error: cannot find -lPhysX3PROFILE
 MainFrameActions: Packaging (Android (ATC)): UnrealBuildTool: D:/NVPACK/android-ndk-r9c/toolchains/arm-linux-androideabi-4.8/prebuilt/windows/lib/gcc/arm-linux-androideabi/4.8/../../../../arm-linux-androideabi/bin/ld.exe: error: cannot find -lPhysX3CharacterKinematicPROFILE
 MainFrameActions: Packaging (Android (ATC)): UnrealBuildTool: D:/NVPACK/android-ndk-r9c/toolchains/arm-linux-androideabi-4.8/prebuilt/windows/lib/gcc/arm-linux-androideabi/4.8/../../../../arm-linux-androideabi/bin/ld.exe: error: cannot find -lPhysX3ExtensionsPROFILE
 MainFrameActions: Packaging (Android (ATC)): UnrealBuildTool: D:/NVPACK/android-ndk-r9c/toolchains/arm-linux-androideabi-4.8/prebuilt/windows/lib/gcc/arm-linux-androideabi/4.8/../../../../arm-linux-androideabi/bin/ld.exe: error: cannot find -lPhysX3CommonPROFILE
 MainFrameActions: Packaging (Android (ATC)): UnrealBuildTool: D:/NVPACK/android-ndk-r9c/toolchains/arm-linux-androideabi-4.8/prebuilt/windows/lib/gcc/arm-linux-androideabi/4.8/../../../../arm-linux-androideabi/bin/ld.exe: error: cannot find -lPhysX3VehiclePROFILE
 MainFrameActions: Packaging (Android (ATC)): UnrealBuildTool: D:/NVPACK/android-ndk-r9c/toolchains/arm-linux-androideabi-4.8/prebuilt/windows/lib/gcc/arm-linux-androideabi/4.8/../../../../arm-linux-androideabi/bin/ld.exe: error: cannot find -lPxTaskPROFILE
 MainFrameActions: Packaging (Android (ATC)): UnrealBuildTool: D:/NVPACK/android-ndk-r9c/toolchains/arm-linux-androideabi-4.8/prebuilt/windows/lib/gcc/arm-linux-androideabi/4.8/../../../../arm-linux-androideabi/bin/ld.exe: error: cannot find -lPhysXVisualDebuggerSDKPROFILE
 MainFrameActions: Packaging (Android (ATC)): UnrealBuildTool: D:/NVPACK/android-ndk-r9c/toolchains/arm-linux-androideabi-4.8/prebuilt/windows/lib/gcc/arm-linux-androideabi/4.8/../../../../arm-linux-androideabi/bin/ld.exe: error: cannot find -lPhysXProfileSDKPROFILE
 MainFrameActions: Packaging (Android (ATC)): UnrealBuildTool: D:/NVPACK/android-ndk-r9c/toolchains/arm-linux-androideabi-4.8/prebuilt/windows/lib/gcc/arm-linux-androideabi/4.8/../../../../arm-linux-androideabi/bin/ld.exe: error: cannot find -lPvdRuntimePROFILE
 MainFrameActions: Packaging (Android (ATC)): UnrealBuildTool: D:/NVPACK/android-ndk-r9c/toolchains/arm-linux-androideabi-4.8/prebuilt/windows/lib/gcc/arm-linux-androideabi/4.8/../../../../arm-linux-androideabi/bin/ld.exe: error: cannot find -lSceneQueryPROFILE
 MainFrameActions: Packaging (Android (ATC)): UnrealBuildTool: D:/NVPACK/android-ndk-r9c/toolchains/arm-linux-androideabi-4.8/prebuilt/windows/lib/gcc/arm-linux-androideabi/4.8/../../../../arm-linux-androideabi/bin/ld.exe: error: cannot find -lSimulationControllerPROFILE
 MainFrameActions: Packaging (Android (ATC)): UnrealBuildTool: D:/NVPACK/android-ndk-r9c/toolchains/arm-linux-androideabi-4.8/prebuilt/windows/lib/gcc/arm-linux-androideabi/4.8/../../../../arm-linux-androideabi/bin/ld.exe: error: cannot find -licudata
 MainFrameActions: Packaging (Android (ATC)): UnrealBuildTool: D:/NVPACK/android-ndk-r9c/toolchains/arm-linux-androideabi-4.8/prebuilt/windows/lib/gcc/arm-linux-androideabi/4.8/../../../../arm-linux-androideabi/bin/ld.exe: error: cannot find -licuuc
 MainFrameActions: Packaging (Android (ATC)): UnrealBuildTool: D:/NVPACK/android-ndk-r9c/toolchains/arm-linux-androideabi-4.8/prebuilt/windows/lib/gcc/arm-linux-androideabi/4.8/../../../../arm-linux-androideabi/bin/ld.exe: error: cannot find -licui18n
 MainFrameActions: Packaging (Android (ATC)): UnrealBuildTool: D:/NVPACK/android-ndk-r9c/toolchains/arm-linux-androideabi-4.8/prebuilt/windows/lib/gcc/arm-linux-androideabi/4.8/../../../../arm-linux-androideabi/bin/ld.exe: error: cannot find -licule
 MainFrameActions: Packaging (Android (ATC)): UnrealBuildTool: D:/NVPACK/android-ndk-r9c/toolchains/arm-linux-androideabi-4.8/prebuilt/windows/lib/gcc/arm-linux-androideabi/4.8/../../../../arm-linux-androideabi/bin/ld.exe: error: cannot find -liculx
 MainFrameActions: Packaging (Android (ATC)): UnrealBuildTool: D:/NVPACK/android-ndk-r9c/toolchains/arm-linux-androideabi-4.8/prebuilt/windows/lib/gcc/arm-linux-androideabi/4.8/../../../../arm-linux-androideabi/bin/ld.exe: error: cannot find -licuio
 MainFrameActions: Packaging (Android (ATC)): UnrealBuildTool: D:/NVPACK/android-ndk-r9c/toolchains/arm-linux-androideabi-4.8/prebuilt/windows/lib/gcc/arm-linux-androideabi/4.8/../../../../arm-linux-androideabi/bin/ld.exe: error: cannot find -lfreetype2412
 MainFrameActions: Packaging (Android (ATC)): UnrealBuildTool: D:/NVPACK/android-ndk-r9c/toolchains/arm-linux-androideabi-4.8/prebuilt/windows/lib/gcc/arm-linux-androideabi/4.8/../../../../arm-linux-androideabi/bin/ld.exe: error: cannot find -lcurl
 MainFrameActions: Packaging (Android (ATC)): UnrealBuildTool: D:/NVPACK/android-ndk-r9c/toolchains/arm-linux-androideabi-4.8/prebuilt/windows/lib/gcc/arm-linux-androideabi/4.8/../../../../arm-linux-androideabi/bin/ld.exe: error: cannot find -lcrypto
 MainFrameActions: Packaging (Android (ATC)): UnrealBuildTool: D:/NVPACK/android-ndk-r9c/toolchains/arm-linux-androideabi-4.8/prebuilt/windows/lib/gcc/arm-linux-androideabi/4.8/../../../../arm-linux-androideabi/bin/ld.exe: error: cannot find -lssl
 MainFrameActions: Packaging (Android (ATC)): UnrealBuildTool: D:/NVPACK/android-ndk-r9c/toolchains/arm-linux-androideabi-4.8/prebuilt/windows/lib/gcc/arm-linux-androideabi/4.8/../../../../arm-linux-androideabi/bin/ld.exe: error: cannot find -lpng
 MainFrameActions: Packaging (Android (ATC)): UnrealBuildTool: D:/NVPACK/android-ndk-r9c/toolchains/arm-linux-androideabi-4.8/prebuilt/windows/lib/gcc/arm-linux-androideabi/4.8/../../../../arm-linux-androideabi/bin/ld.exe: error: cannot find -logg
 MainFrameActions: Packaging (Android (ATC)): UnrealBuildTool: D:/NVPACK/android-ndk-r9c/toolchains/arm-linux-androideabi-4.8/prebuilt/windows/lib/gcc/arm-linux-androideabi/4.8/../../../../arm-linux-androideabi/bin/ld.exe: error: cannot find -lvorbis
 MainFrameActions: Packaging (Android (ATC)): UnrealBuildTool: D:/NVPACK/android-ndk-r9c/toolchains/arm-linux-androideabi-4.8/prebuilt/windows/lib/gcc/arm-linux-androideabi/4.8/../../../../arm-linux-androideabi/bin/ld.exe: error: cannot find -lvorbisfile
 MainFrameActions: Packaging (Android (ATC)): UnrealBuildTool: D:/NVPACK/android-ndk-r9c/toolchains/arm-linux-androideabi-4.8/prebuilt/windows/lib/gcc/arm-linux-androideabi/4.8/../../../../arm-linux-androideabi/bin/ld.exe: fatal error: F:/gameDNAstudio/Chasing Robbers Repository/ChasingRobbers/Binaries/Android/ChasingRobbers-Android-Shipping-armv7-es2.so: mmap: failed to allocate 559077580 bytes for output file: Not enough space
 MainFrameActions: Packaging (Android (ATC)): UnrealBuildTool: clang++.exe: error: linker command failed with exit code 1 (use -v to see invocation)
 MainFrameActions: Packaging (Android (ATC)): UnrealBuildTool: -------- End Detailed Actions Stats -----------------------------------------------------------
 MainFrameActions: Packaging (Android (ATC)): UnrealBuildTool: ERROR: UBT ERROR: Failed to produce item: F:\gameDNAstudio\Chasing Robbers Repository\ChasingRobbers\Binaries\Android\ChasingRobbers-Android-Shipping-armv7-es2.so
 MainFrameActions: Packaging (Android (ATC)): UnrealBuildTool: Total build time: 15.84 seconds
 MainFrameActions: Packaging (Android (ATC)): CommandUtils.Run: Run: Took 15.966959s to run UnrealBuildTool.exe, ExitCode=5
 MainFrameActions: Packaging (Android (ATC)): ErrorReporter.Error: ERROR: AutomationTool error: Command failed (Result:5): F:\Epic Games\4.8\Engine\Binaries\DotNET\UnrealBuildTool.exe ChasingRobbers Android Shipping  "F:\gameDNAstudio\Chasing Robbers Repository\ChasingRobbers\ChasingRobbers.uproject" 
 MainFrameActions: Packaging (Android (ATC)):  -noxge -NoHotReloadFromIDE -ignorejunk. See logfile for details: 'UnrealBuildTool.txt' 
 MainFrameActions: Packaging (Android (ATC)): BuildCommand.Execute: ERROR: BUILD FAILED
Product Version: UE 4.8
Tags:
more ▼

asked Aug 02 '15 at 10:53 AM in Using UE4

avatar image

kodmistrz
314 54 81 101

(comments are locked)
10|2000 characters needed characters left

2 answers: sort voted first

I had same problem.

I was able to fix this by uninstall TADP 2.0r8, reboot and install TADP 3.0r4

more ▼

answered Aug 20 '15 at 11:26 AM

avatar image

MrHwang
71 3 6 8

avatar image synthure Sep 04 '15 at 04:14 AM

this worked! thank you so much.

(comments are locked)
10|2000 characters needed characters left

I'm also getting a similar error when compiling for Android. UnrealBuildTool: C:/NVPACK/android-ndk-r9c/toolchains/arm-linux-androideabi-4.8/prebuilt/windows/lib/gcc/arm-linux-androideabi/4.8/../../../../arm-linux-androideabi/bin/ld.exe: fatal error: C:/Users/../Documents/Unreal Projects/GearTest/Binaries/Android/GearTest-armv7-es2.so: mmap: failed to allocate 680182044 bytes for output file: Not enough space. \

more ▼

answered Aug 19 '15 at 10:32 PM

avatar image

synthure
6 1 2

avatar image kemuri Jan 19 '19 at 10:07 AM

seems like you running out of diskspace

avatar image seraniz Jan 21 '19 at 06:09 PM

I was able to fix this by uninstall TADP 2.0r8, reboot and install TADP 3.0r4

https://ovo.fyi/redtube/ https://ovo.fyi/beeg/ https://ovo.fyi/spankbang/

(comments are locked)
10|2000 characters needed characters left
Your answer
toggle preview:

Up to 5 attachments (including images) can be used with a maximum of 5.2 MB each and 5.2 MB total.

Follow this question

Once you sign in you will be able to subscribe for any updates here

Answers to this question