x

Search in
Sort by:

Question Status:

Search help

  • Simple searches use one or more words. Separate the words with spaces (cat dog) to search cat,dog or both. Separate the words with plus signs (cat +dog) to search for items that may contain cat but must contain dog.
  • You can further refine your search on the search results page, where you can search by keywords, author, topic. These can be combined with each other. Examples
    • cat dog --matches anything with cat,dog or both
    • cat +dog --searches for cat +dog where dog is a mandatory term
    • cat -dog -- searches for cat excluding any result containing dog
    • [cats] —will restrict your search to results with topic named "cats"
    • [cats] [dogs] —will restrict your search to results with both topics, "cats", and "dogs"

Packaging Error

Hi, recently i have upgraded to 4.8.3 to 4.9, but they still showing me errors when i try to package.

I have already rebuild the engine, the project and it still showing me this :

 MainFrameActions: Packaging (Windows (64-bit)): MSBuild: Time Elapsed 00:00:01.11
 MainFrameActions: Packaging (Windows (64-bit)): CommandUtils.Run: Run: Took 1,1930683s to run MSBuild.exe, ExitCode=0
 MainFrameActions: Packaging (Windows (64-bit)): CommandUtils.Run: Run: E:\UE4.9.0\Engine\Binaries\DotNET\UnrealBuildTool.exe Etherion Win64 Development  E:\Etherion\Etherion\Etherion.uproject  -noxge -generatemanifest -NoHotReloadFromIDE
 MainFrameActions: Packaging (Windows (64-bit)): CommandUtils.Run: Run: Took 2,6341506s to run UnrealBuildTool.exe, ExitCode=0
 MainFrameActions: Packaging (Windows (64-bit)): UE4Build.PrepareManifest: Copied UBT manifest to E:\UE4.9.0\Engine\Programs\AutomationTool\Saved\Logs\UBTManifest.0.xml
 MainFrameActions: Packaging (Windows (64-bit)): CommandUtils.Run: Run: E:\UE4.9.0\Engine\Binaries\DotNET\UnrealBuildTool.exe Etherion Win64 Development  E:\Etherion\Etherion\Etherion.uproject  -noxge -NoHotReloadFromIDE -ignorejunk
 MainFrameActions: Packaging (Windows (64-bit)): UnrealBuildTool: Creating makefile for Etherion (project files are newer)
 MainFrameActions: Packaging (Windows (64-bit)): UnrealBuildTool: Performing 3 actions (4 in parallel)
 MainFrameActions: Packaging (Windows (64-bit)): UnrealBuildTool: Module.Json.cpp
 MainFrameActions: Packaging (Windows (64-bit)): UnrealBuildTool: Module.Launch.cpp
 MainFrameActions: Packaging (Windows (64-bit)): UnrealBuildTool: e:\etherion\etherion\intermediate\build\win64\etherion\development\json\Core.h(4) : fatal error C1083: Impossible d'ouvrir le fichier include�: 'D:\UE4.8\Engine\Source\Runtime\Core\Public\Core.h'�: No such file or directory
 MainFrameActions: Packaging (Windows (64-bit)): UnrealBuildTool: e:\etherion\etherion\intermediate\build\win64\etherion\development\launch\Engine.h(4) : fatal error C1083: Impossible d'ouvrir le fichier include�: 'D:\UE4.8\Engine\Source\Runtime\Engine\Public\Engine.h'�: No such file or directory
 MainFrameActions: Packaging (Windows (64-bit)): UnrealBuildTool: -------- End Detailed Actions Stats -----------------------------------------------------------
 MainFrameActions: Packaging (Windows (64-bit)): UnrealBuildTool: ERROR: UBT ERROR: Failed to produce item: E:\Etherion\Etherion\Binaries\Win64\Etherion.pdb
 MainFrameActions: Packaging (Windows (64-bit)): UnrealBuildTool: Total build time: 6,76 seconds
 MainFrameActions: Packaging (Windows (64-bit)): CommandUtils.Run: Run: Took 6,7933885s to run UnrealBuildTool.exe, ExitCode=5
 MainFrameActions: Packaging (Windows (64-bit)): BuildCommand.Execute: ERROR: BUILD FAILED
 MainFrameActions: Packaging (Windows (64-bit)): Program.Main: ERROR: AutomationTool terminated with exception:
 MainFrameActions: Packaging (Windows (64-bit)): Program.Main: ERROR: Exception in AutomationUtils.Automation: Command failed (Result:5): E:\UE4.9.0\Engine\Binaries\DotNET\UnrealBuildTool.exe Etherion Win64 Development  E:\Etherion\Etherion\Etherion.uproject  -noxge -NoHotReloadFromIDE -ignorejunk. See logfile for details: 'UnrealBuildTool-2015.09.13-23.27.20.txt' 
 MainFrameActions: Packaging (Windows (64-bit)): Stacktrace:    at AutomationTool.CommandUtils.RunAndLog(String App, String CommandLine, String Logfile, Int32 MaxSuccessCode, String Input, ERunOptions Options, Dictionary`2 EnvVars) in e:\UE4.9.0\Engine\Source\Programs\AutomationTool\AutomationUtils\ProcessUtils.cs:line 800
 MainFrameActions: Packaging (Windows (64-bit)):    at AutomationTool.CommandUtils.RunUBT(CommandEnvironment Env, String UBTExecutable, String CommandLine, String LogName, Dictionary`2 EnvVars) in e:\UE4.9.0\Engine\Source\Programs\AutomationTool\AutomationUtils\UBTUtils.cs:line 50
 MainFrameActions: Packaging (Windows (64-bit)):    at AutomationTool.UE4Build.BuildWithUBT(String ProjectName, String TargetName, UnrealTargetPlatform TargetPlatform, String Config, String UprojectPath, Boolean ForceMonolithic, Boolean Force
 MainFrameActions: Packaging (Windows (64-bit)): NonUnity, Boolean ForceDebugInfo, Boolean ForceFlushMac, Boolean DisableXGE, String InAddArgs, Boolean ForceUnity, Dictionary`2 EnvVars) in e:\UE4.9.0\Engine\Source\Programs\AutomationTool\AutomationUtils\UE4Build.cs:line 347
 MainFrameActions: Packaging (Windows (64-bit)):    at AutomationTool.UE4Build.Build(BuildAgenda Agenda, Nullable`1 InDeleteBuildProducts, Boolean InUpdateVersionFiles, Boolean InForceNoXGE, Boolean InUseParallelExecutor, Boolean InForceNonUnity, Boolean InForceUnity, Boolean InShowProgress, Dictionary`2 PlatformEnvVars) in e:\UE4.9.0\Engine\Source\Programs\AutomationTool\AutomationUtils\UE4Build.cs:line 1463
 MainFrameActions: Packaging (Windows (64-bit)):    at Project.Build(BuildCommand Command, ProjectParams Params, Int32 WorkingCL) in e:\UE4.9.0\Engine\Source\Programs\AutomationTool\Scripts\BuildProjectCommand.Automation.cs:line 114
 MainFrameActions: Packaging (Windows (64-bit)):    at BuildCookRun.DoBuildCookRun(ProjectParams Params) in e:\UE4.9.0\Engine\Source\Programs\AutomationTool\Scripts\BuildCookRun.Automation.cs:line 209
 MainFrameActions: Packaging (Windows (64-bit)):    at BuildCommand.Execute() in e:\UE4.9.0\Engine\Source\Programs\AutomationTool\AutomationUtils\BuildCommand.cs:line 37
 MainFrameActions: Packaging (Windows (64-bit)):    at AutomationTool.Automation.Execute(List`1 CommandsToExecute, CaselessDictionary`1 Commands) in e:\UE4.9.0\Engine\Source\Programs\AutomationTool\AutomationUtils\Automation.cs:line 392
 MainFrameActions: Packaging (Windows (64-bit)):    at AutomationTool.Automation.Process(String[] CommandLine) in e:\UE4.9.0\Engine\Source\Programs\AutomationTool\AutomationUtils\Automation.cs:line 360
 MainFrameActions: Packaging (Windows (64-bit)):    at AutomationTool.Program.MainProc(Object Param) in e:\UE4.9.0\Engine\Source\Programs\AutomationTool\Program.cs:line 135
 MainFrameActions: Packaging (Windows (64-bit)):    at AutomationTool.InternalUtils.RunSingleInstance(Action`1 Main, Object Param) in e:\UE4.9.0\Engine\Source\Programs\AutomationTool\AutomationUtils\Utils.cs:line 708
 MainFrameActions: Packaging (Windows (64-bit)):    at AutomationTool.Program.Main() in e:\UE4.9.0\Engine\Source\Programs\AutomationTool\Program.cs:line 53
 MainFrameActions: Packaging (Windows (64-bit)): ProcessManager.KillAll: Trying to kill 0 spawned processes.
 MainFrameActions: Packaging (Windows (64-bit)): Program.Main: AutomationTool exiting with ExitCode=5
 MainFrameActions: Packaging (Windows (64-bit)): Domain_ProcessExit
 MainFrameActions: Packaging (Windows (64-bit)): AutomationToolLauncher exiting with ExitCode=5
 MainFrameActions: Packaging (Windows (64-bit)): copying UAT log files...
 MainFrameActions: Packaging (Windows (64-bit)): RunUAT.bat ERROR: AutomationTool was unable to run successfully.
 MainFrameActions: Packaging (Windows (64-bit)): BUILD FAILED
 PackagingResults:Error: Error Unknown Error


As you can see, he go seeking for the old engine (4.8.3). How to fix that ?

 UnrealBuildTool: e:\etherion\etherion\intermediate\build\win64\etherion\development\json\Core.h(4) : fatal error C1083: Impossible d'ouvrir le fichier include�: 'D:\UE4.8\Engine\Source\Runtime\Core\Public\Core.h'�: No such file or directory
 MainFrameActions: Packaging (Windows (64-bit)): UnrealBuildTool: e:\etherion\etherion\intermediate\build\win64\etherion\development\launch\Engine.h(4) : fatal error C1083: Impossible d'ouvrir le fichier include�: 'D:\UE4.8\Engine\Source\Runtime\Engine\Public\Engine.h'�: No such file or directory
Product Version: UE 4.9
Tags:
more ▼

asked Sep 13 '15 at 09:31 PM in Packaging & Deployment

avatar image

VL4D
74 8 12 18

avatar image Adam Davis STAFF Sep 14 '15 at 06:50 PM

Hi VL4D,

Does this occur with a clean, blank project with no additional content or does it only occur on one project? What system are you trying to package to?

(comments are locked)
10|2000 characters needed characters left
Viewable by all users

1 answer: sort voted first

Hello, i make the solution worked, i have found in the core.h and engine.h of the project, that will not be updated correctly and he was still on the 4.8.3 update.

more ▼

answered Sep 15 '15 at 06:20 PM

avatar image

VL4D
74 8 12 18

(comments are locked)
10|2000 characters needed characters left
Viewable by all users
Your answer
toggle preview:

Up to 5 attachments (including images) can be used with a maximum of 5.2 MB each and 5.2 MB total.

Follow this question

Once you sign in you will be able to subscribe for any updates here

Answers to this question