x

Search in
Sort by:

Question Status:

Search help

  • Simple searches use one or more words. Separate the words with spaces (cat dog) to search cat,dog or both. Separate the words with plus signs (cat +dog) to search for items that may contain cat but must contain dog.
  • You can further refine your search on the search results page, where you can search by keywords, author, topic. These can be combined with each other. Examples
    • cat dog --matches anything with cat,dog or both
    • cat +dog --searches for cat +dog where dog is a mandatory term
    • cat -dog -- searches for cat excluding any result containing dog
    • [cats] —will restrict your search to results with topic named "cats"
    • [cats] [dogs] —will restrict your search to results with both topics, "cats", and "dogs"

Can someone pls help me to fix my university-project?

Hi folks....

i have a big problem.!!! My university-project is not able to create a .exe. I've started to do it with File->cook content for windows

and then we have the problem.

I tryed to fix it with an idea from a friend who told me to delete some folders (Intermidiate, Saved) from the root direction of the project. At leased nothing worked... Can someone help me please.?

MainFrameActions: Cooking (Windows): UE4Editor-Cmd: [2015.09.22-17.48.39:764][ 0]LogExit: Exiting. MainFrameActions: Cooking (Windows): CommandUtils.Run: Run: Took 56,1578362s to run UE4Editor-Cmd.exe, ExitCode=1 MainFrameActions: Cooking (Windows): InternalUtils.SafeCopyFile: SafeCopyFile D:\Software\Unreal\Epic Games\4.8\Engine\Programs\AutomationTool\Saved\Cook.txt C:\Users\Christian\AppData\Roaming\Unreal Engine\AutomationTool\Logs\D+Software+Unreal+Epic+Games+4.8\Cook.txt MainFrameActions: Cooking (Windows): InternalUtils.SafeDeleteFile: SafeDeleteFile D:\Software\Unreal\Epic Games\4.8\Engine\Programs\AutomationTool\Saved\Cook.txt MainFrameActions: Cooking (Windows): Project.Cook: Cook failed. Deleting cooked data. MainFrameActions: Cooking (Windows): ErrorReporter.Error: ERROR: AutomationTool error: Cook failed. MainFrameActions: Cooking (Windows): BuildCommand.Execute: ERROR: BUILD FAILED MainFrameActions: Cooking (Windows): Program.Main: ERROR: AutomationTool terminated with exception: MainFrameActions: Cooking (Windows): Program.Main: ERROR: Exception in AutomationScripts.Automation: BUILD FAILED: Failed while running Cook for C:\Users\Christian\Documents\abschlussprojekt_kds_v2\Abschlussprojekt\unreal\chamber_of_secrets\chamber_of_secrets.uproject; see log C:\Users\Christ MainFrameActions: Cooking (Windows): ian\AppData\Roaming\Unreal Engine\AutomationTool\Logs\D+Software+Unreal+Epic+Games+4.8\Cook.txt MainFrameActions: Cooking (Windows): Stacktrace: bei Project.Cook(ProjectParams Params) MainFrameActions: Cooking (Windows): bei BuildCookRun.DoBuildCookRun(ProjectParams Params) MainFrameActions: Cooking (Windows): bei BuildCommand.Execute() MainFrameActions: Cooking (Windows): bei AutomationTool.Automation.Execute(List`1 CommandsToExecute, CaselessDictionary`1 Commands) MainFrameActions: Cooking (Windows): bei AutomationTool.Automation.Process(String[] CommandLine) MainFrameActions: Cooking (Windows): bei AutomationTool.Program.MainProc(Object Param) MainFrameActions: Cooking (Windows): bei AutomationTool.InternalUtils.RunSingleInstance(MainProc Main, Object Param) MainFrameActions: Cooking (Windows): bei AutomationTool.Program.Main() MainFrameActions: Cooking (Windows): Program.Main: ERROR: BUILD FAILED: Failed while running Cook for C:\Users\Christian\Documents\abschlussprojekt_kds_v2\Abschlussprojekt\unreal\chamber_of_secrets\chamber_of_secrets.uproject; see log C:\Users\Christian\AppData\Roaming\Unreal Engine\AutomationTool\Logs\D+Software+Unreal+Epic+Games+4.8\Cook.txt MainFrameActions: Cooking (Windows): ProcessManager.KillAll: Trying to kill 0 spawned processes. MainFrameActions: Cooking (Windows): Program.Main: AutomationTool exiting with ExitCode=25 MainFrameActions: Cooking (Windows): Domain_ProcessExit MainFrameActions: Cooking (Windows): ProcessManager.KillAll: Trying to kill 0 spawned processes. MainFrameActions: Cooking (Windows): copying UAT log files... MainFrameActions: Cooking (Windows): RunUAT.bat ERROR: AutomationTool was unable to run successfully. MainFrameActions: Cooking (Windows): BUILD FAILED

Product Version: UE 4.8
Tags:
more ▼

asked Sep 22 '15 at 07:43 PM in Using UE4

avatar image

deadline42
1 2

(comments are locked)
10|2000 characters needed characters left
Viewable by all users

0 answers: sort voted first
Be the first one to answer this question
toggle preview:

Up to 5 attachments (including images) can be used with a maximum of 5.2 MB each and 5.2 MB total.

Follow this question

Once you sign in you will be able to subscribe for any updates here

Answers to this question