x

Search in
Sort by:

Question Status:

Search help

  • Simple searches use one or more words. Separate the words with spaces (cat dog) to search cat,dog or both. Separate the words with plus signs (cat +dog) to search for items that may contain cat but must contain dog.
  • You can further refine your search on the search results page, where you can search by keywords, author, topic. These can be combined with each other. Examples
    • cat dog --matches anything with cat,dog or both
    • cat +dog --searches for cat +dog where dog is a mandatory term
    • cat -dog -- searches for cat excluding any result containing dog
    • [cats] —will restrict your search to results with topic named "cats"
    • [cats] [dogs] —will restrict your search to results with both topics, "cats", and "dogs"

Office Holiday

Epic Games' offices will be on holiday from June 22nd to July 7th. During this period support will be limited. Our offices will reopen on Monday, July 8th. 

[BUG]Cannot Compile Any Of The C++ Templates

  • Bug Report

  • Build info - Version: 1904627 - Install Path: C:/Program Files/Rocket

Specs - OS: Windows 7 x64 - RAM: 4 GB - Graphics Card: ATI HD6770 w/ 1 GB - UAC: Off - Visual Studio 2012 Ultimate

I tried to create a new c++ template but it just says this,

Project 'MyProject' was created successfully, but there was a problem compiling it. Would you like to open the project in your code editing IDE to attempt to debug it?

i then tried them all and every c++ project is now spitting this at me..

I closed this and then reopen it up in rocket and it says, the game module "MyProject" could not be found. Please Ensure that this module exists and that it is compiled.

I then open the Solution up and try to build it and i get warnings and the uproject still cant find the module

 1>------ Build started: Project: MyProject2, Configuration: Debug_RocketGame x64 ------
 1>  Parsing headers for MyProject2
 1>  Code generation finished for MyProject2 and took 2.697
 1>  rc.exe MyProject2.rc
 1>  UELinkerFixups.cpp
 1>  Module.MyProject2.cpp
 1>  link.exe MyProject2-Win64-Debug.exe
 1>     Creating library C:\Plabs\RocketUE4\SaxonRah\ParabolicLabs\Copy\Parabolic Labs\Project Trinity\Programmers\MyProject2\Binaries\Win64\MyProject2-Win64-Debug.lib and object C:\Plabs\RocketUE4\SaxonRah\ParabolicLabs\Copy\Parabolic Labs\Project Trinity\Programmers\MyProject2\Binaries\Win64\MyProject2-Win64-Debug.exp
 1>RocketLib.lib(PackUniformBuffers.obj) : warning LNK4099: PDB 'hlslcc_64.pdb' was not found with 'RocketLib.lib(PackUniformBuffers.obj)' or at 'C:\Plabs\RocketUE4\SaxonRah\ParabolicLabs\Copy\Parabolic Labs\Project Trinity\Programmers\MyProject2\Binaries\Win64\hlslcc_64.pdb'; linking object as if no debug info
 1>RocketLib.lib(OptValueNumbering.obj) : warning LNK4099: PDB 'hlslcc_64.pdb' was not found with 'RocketLib.lib(OptValueNumbering.obj)' or at 'C:\Plabs\RocketUE4\SaxonRah\ParabolicLabs\Copy\Parabolic Labs\Project Trinity\Programmers\MyProject2\Binaries\Win64\hlslcc_64.pdb'; linking object as if no debug info
 1>RocketLib.lib(symbol_table.obj) : warning LNK4099: PDB 'hlslcc_64.pdb' was not found with 'RocketLib.lib(symbol_table.obj)' or at 'C:\Plabs\RocketUE4\SaxonRah\ParabolicLabs\Copy\Parabolic Labs\Project Trinity\Programmers\MyProject2\Binaries\Win64\hlslcc_64.pdb'; linking object as if no debug info
 1>RocketLib.lib(strtod.obj) : warning LNK4099: PDB 'hlslcc_64.pdb' was not found with 'RocketLib.lib(strtod.obj)' or at 'C:\Plabs\RocketUE4\SaxonRah\ParabolicLabs\Copy\Parabolic Labs\Project Trinity\Programmers\MyProject2\Binaries\Win64\hlslcc_64.pdb'; linking object as if no debug info
 1>RocketLib.lib(ralloc.obj) : warning LNK4099: PDB 'hlslcc_64.pdb' was not found with 'RocketLib.lib(ralloc.obj)' or at 'C:\Plabs\RocketUE4\SaxonRah\ParabolicLabs\Copy\Parabolic Labs\Project Trinity\Programmers\MyProject2\Binaries\Win64\hlslcc_64.pdb'; linking object as if no debug info
 1>RocketLib.lib(pp.obj) : warning LNK4099: PDB 'hlslcc_64.pdb' was not found with 'RocketLib.lib(pp.obj)' or at 'C:\Plabs\RocketUE4\SaxonRah\ParabolicLabs\Copy\Parabolic Labs\Project Trinity\Programmers\MyProject2\Binaries\Win64\hlslcc_64.pdb'; linking object as if no debug info
 1>RocketLib.lib(opt_tree_grafting.obj) : warning LNK4099: PDB 'hlslcc_64.pdb' was not found with 'RocketLib.lib(opt_tree_grafting.obj)' or at 'C:\Plabs\RocketUE4\SaxonRah\ParabolicLabs\Copy\Parabolic Labs\Project Trinity\Programmers\MyProject2\Binaries\Win64\hlslcc_64.pdb'; linking object as if no debug info
 1>RocketLib.lib(opt_swizzle_swizzle.obj) : warning LNK4099: PDB 'hlslcc_64.pdb' was not found with 'RocketLib.lib(opt_swizzle_swizzle.obj)' or at 'C:\Plabs\RocketUE4\SaxonRah\ParabolicLabs\Copy\Parabolic Labs\Project Trinity\Programmers\MyProject2\Binaries\Win64\hlslcc_64.pdb'; linking object as if no debug info
 1>RocketLib.lib(opt_structure_splitting.obj) : warning LNK4099: PDB 'hlslcc_64.pdb' was not found with 'RocketLib.lib(opt_structure_splitting.obj)' or at 'C:\Plabs\RocketUE4\SaxonRah\ParabolicLabs\Copy\Parabolic Labs\Project Trinity\Programmers\MyProject2\Binaries\Win64\hlslcc_64.pdb'; linking object as if no debug info
 1>RocketLib.lib(opt_redundant_jumps.obj) : warning LNK4099: PDB 'hlslcc_64.pdb' was not found with 'RocketLib.lib(opt_redundant_jumps.obj)' or at 'C:\Plabs\RocketUE4\SaxonRah\ParabolicLabs\Copy\Parabolic Labs\Project Trinity\Programmers\MyProject2\Binaries\Win64\hlslcc_64.pdb'; linking object as if no debug info
 1>RocketLib.lib(opt_noop_swizzle.obj) : warning LNK4099: PDB 'hlslcc_64.pdb' was not found with 'RocketLib.lib(opt_noop_swizzle.obj)' or at 'C:\Plabs\RocketUE4\SaxonRah\ParabolicLabs\Copy\Parabolic Labs\Project Trinity\Programmers\MyProject2\Binaries\Win64\hlslcc_64.pdb'; linking object as if no debug info
 1>RocketLib.lib(opt_if_simplification.obj) : warning LNK4099: PDB 'hlslcc_64.pdb' was not found with 'RocketLib.lib(opt_if_simplification.obj)' or at 'C:\Plabs\RocketUE4\SaxonRah\ParabolicLabs\Copy\Parabolic Labs\Project Trinity\Programmers\MyProject2\Binaries\Win64\hlslcc_64.pdb'; linking object as if no debug info
 1>RocketLib.lib(opt_function_inlining.obj) : warning LNK4099: PDB 'hlslcc_64.pdb' was not found with 'RocketLib.lib(opt_function_inlining.obj)' or at 'C:\Plabs\RocketUE4\SaxonRah\ParabolicLabs\Copy\Parabolic Labs\Project Trinity\Programmers\MyProject2\Binaries\Win64\hlslcc_64.pdb'; linking object as if no debug info
 1>RocketLib.lib(opt_discard_simplification.obj) : warning LNK4099: PDB 'hlslcc_64.pdb' was not found with 'RocketLib.lib(opt_discard_simplification.obj)' or at 'C:\Plabs\RocketUE4\SaxonRah\ParabolicLabs\Copy\Parabolic Labs\Project Trinity\Programmers\MyProject2\Binaries\Win64\hlslcc_64.pdb'; linking object as if no debug info
 1>RocketLib.lib(opt_dead_functions.obj) : warning LNK4099: PDB 'hlslcc_64.pdb' was not found with 'RocketLib.lib(opt_dead_functions.obj)' or at 'C:\Plabs\RocketUE4\SaxonRah\ParabolicLabs\Copy\Parabolic Labs\Project Trinity\Programmers\MyProject2\Binaries\Win64\hlslcc_64.pdb'; linking object as if no debug info
 1>RocketLib.lib(opt_dead_code_local.obj) : warning LNK4099: PDB 'hlslcc_64.pdb' was not found with 'RocketLib.lib(opt_dead_code_local.obj)' or at 'C:\Plabs\RocketUE4\SaxonRah\ParabolicLabs\Copy\Parabolic Labs\Project Trinity\Programmers\MyProject2\Binaries\Win64\hlslcc_64.pdb'; linking object as if no debug info
 1>RocketLib.lib(opt_dead_code.obj) : warning LNK4099: PDB 'hlslcc_64.pdb' was not found with 'RocketLib.lib(opt_dead_code.obj)' or at 'C:\Plabs\RocketUE4\SaxonRah\ParabolicLabs\Copy\Parabolic Labs\Project Trinity\Programmers\MyProject2\Binaries\Win64\hlslcc_64.pdb'; linking object as if no debug info
 1>RocketLib.lib(opt_copy_propagation_elements.obj) : warning LNK4099: PDB 'hlslcc_64.pdb' was not found with 'RocketLib.lib(opt_copy_propagation_elements.obj)' or at 'C:\Plabs\RocketUE4\SaxonRah\ParabolicLabs\Copy\Parabolic Labs\Project Trinity\Programmers\MyProject2\Binaries\Win64\hlslcc_64.pdb'; linking object as if no debug info
 1>RocketLib.lib(opt_copy_propagation.obj) : warning LNK4099: PDB 'hlslcc_64.pdb' was not found with 'RocketLib.lib(opt_copy_propagation.obj)' or at 'C:\Plabs\RocketUE4\SaxonRah\ParabolicLabs\Copy\Parabolic Labs\Project Trinity\Programmers\MyProject2\Binaries\Win64\hlslcc_64.pdb'; linking object as if no debug info
 1>RocketLib.lib(opt_constant_variable.obj) : warning LNK4099: PDB 'hlslcc_64.pdb' was not found with 'RocketLib.lib(opt_constant_variable.obj)' or at 'C:\Plabs\RocketUE4\SaxonRah\ParabolicLabs\Copy\Parabolic Labs\Project Trinity\Programmers\MyProject2\Binaries\Win64\hlslcc_64.pdb'; linking object as if no debug info
 1>RocketLib.lib(opt_constant_propagation.obj) : warning LNK4099: PDB 'hlslcc_64.pdb' was not found with 'RocketLib.lib(opt_constant_propagation.obj)' or at 'C:\Plabs\RocketUE4\SaxonRah\ParabolicLabs\Copy\Parabolic Labs\Project Trinity\Programmers\MyProject2\Binaries\Win64\hlslcc_64.pdb'; linking object as if no debug info
 1>RocketLib.lib(opt_constant_folding.obj) : warning LNK4099: PDB 'hlslcc_64.pdb' was not found with 'RocketLib.lib(opt_constant_folding.obj)' or at 'C:\Plabs\RocketUE4\SaxonRah\ParabolicLabs\Copy\Parabolic Labs\Project Trinity\Programmers\MyProject2\Binaries\Win64\hlslcc_64.pdb'; linking object as if no debug info
 1>RocketLib.lib(opt_array_splitting.obj) : warning LNK4099: PDB 'hlslcc_64.pdb' was not found with 'RocketLib.lib(opt_array_splitting.obj)' or at 'C:\Plabs\RocketUE4\SaxonRah\ParabolicLabs\Copy\Parabolic Labs\Project Trinity\Programmers\MyProject2\Binaries\Win64\hlslcc_64.pdb'; linking object as if no debug info
 1>RocketLib.lib(opt_algebraic.obj) : warning LNK4099: PDB 'hlslcc_64.pdb' was not found with 'RocketLib.lib(opt_algebraic.obj)' or at 'C:\Plabs\RocketUE4\SaxonRah\ParabolicLabs\Copy\Parabolic Labs\Project Trinity\Programmers\MyProject2\Binaries\Win64\hlslcc_64.pdb'; linking object as if no debug info
 1>RocketLib.lib(lower_vec_index_to_swizzle.obj) : warning LNK4099: PDB 'hlslcc_64.pdb' was not found with 'RocketLib.lib(lower_vec_index_to_swizzle.obj)' or at 'C:\Plabs\RocketUE4\SaxonRah\ParabolicLabs\Copy\Parabolic Labs\Project Trinity\Programmers\MyProject2\Binaries\Win64\hlslcc_64.pdb'; linking object as if no debug info
 1>RocketLib.lib(lower_jumps.obj) : warning LNK4099: PDB 'hlslcc_64.pdb' was not found with 'RocketLib.lib(lower_jumps.obj)' or at 'C:\Plabs\RocketUE4\SaxonRah\ParabolicLabs\Copy\Parabolic Labs\Project Trinity\Programmers\MyProject2\Binaries\Win64\hlslcc_64.pdb'; linking object as if no debug info
 1>RocketLib.lib(lower_instructions.obj) : warning LNK4099: PDB 'hlslcc_64.pdb' was not found with 'RocketLib.lib(lower_instructions.obj)' or at 'C:\Plabs\RocketUE4\SaxonRah\ParabolicLabs\Copy\Parabolic Labs\Project Trinity\Programmers\MyProject2\Binaries\Win64\hlslcc_64.pdb'; linking object as if no debug info
 1>RocketLib.lib(loop_unroll.obj) : warning LNK4099: PDB 'hlslcc_64.pdb' was not found with 'RocketLib.lib(loop_unroll.obj)' or at 'C:\Plabs\RocketUE4\SaxonRah\ParabolicLabs\Copy\Parabolic Labs\Project Trinity\Programmers\MyProject2\Binaries\Win64\hlslcc_64.pdb'; linking object as if no debug info
 1>RocketLib.lib(loop_controls.obj) : warning LNK4099: PDB 'hlslcc_64.pdb' was not found with 'RocketLib.lib(loop_controls.obj)' or at 'C:\Plabs\RocketUE4\SaxonRah\ParabolicLabs\Copy\Parabolic Labs\Project Trinity\Programmers\MyProject2\Binaries\Win64\hlslcc_64.pdb'; linking object as if no debug info
 1>RocketLib.lib(loop_analysis.obj) : warning LNK4099: PDB 'hlslcc_64.pdb' was not found with 'RocketLib.lib(loop_analysis.obj)' or at 'C:\Plabs\RocketUE4\SaxonRah\ParabolicLabs\Copy\Parabolic Labs\Project Trinity\Programmers\MyProject2\Binaries\Win64\hlslcc_64.pdb'; linking object as if no debug info
 1>RocketLib.lib(ir_variable_refcount.obj) : warning LNK4099: PDB 'hlslcc_64.pdb' was not found with 'RocketLib.lib(ir_variable_refcount.obj)' or at 'C:\Plabs\RocketUE4\SaxonRah\ParabolicLabs\Copy\Parabolic Labs\Project Trinity\Programmers\MyProject2\Binaries\Win64\hlslcc_64.pdb'; linking object as if no debug info
 1>RocketLib.lib(ir_validate.obj) : warning LNK4099: PDB 'hlslcc_64.pdb' was not found with 'RocketLib.lib(ir_validate.obj)' or at 'C:\Plabs\RocketUE4\SaxonRah\ParabolicLabs\Copy\Parabolic Labs\Project Trinity\Programmers\MyProject2\Binaries\Win64\hlslcc_64.pdb'; linking object as if no debug info
 1>RocketLib.lib(ir_rvalue_visitor.obj) : warning LNK4099: PDB 'hlslcc_64.pdb' was not found with 'RocketLib.lib(ir_rvalue_visitor.obj)' or at 'C:\Plabs\RocketUE4\SaxonRah\ParabolicLabs\Copy\Parabolic Labs\Project Trinity\Programmers\MyProject2\Binaries\Win64\hlslcc_64.pdb'; linking object as if no debug info
 1>RocketLib.lib(ir_print_visitor.obj) : warning LNK4099: PDB 'hlslcc_64.pdb' was not found with 'RocketLib.lib(ir_print_visitor.obj)' or at 'C:\Plabs\RocketUE4\SaxonRah\ParabolicLabs\Copy\Parabolic Labs\Project Trinity\Programmers\MyProject2\Binaries\Win64\hlslcc_64.pdb'; linking object as if no debug info
 1>RocketLib.lib(ir_hv_accept.obj) : warning LNK4099: PDB 'hlslcc_64.pdb' was not found with 'RocketLib.lib(ir_hv_accept.obj)' or at 'C:\Plabs\RocketUE4\SaxonRah\ParabolicLabs\Copy\Parabolic Labs\Project Trinity\Programmers\MyProject2\Binaries\Win64\hlslcc_64.pdb'; linking object as if no debug info
 1>RocketLib.lib(ir_hierarchical_visitor.obj) : warning LNK4099: PDB 'hlslcc_64.pdb' was not found with 'RocketLib.lib(ir_hierarchical_visitor.obj)' or at 'C:\Plabs\RocketUE4\SaxonRah\ParabolicLabs\Copy\Parabolic Labs\Project Trinity\Programmers\MyProject2\Binaries\Win64\hlslcc_64.pdb'; linking object as if no debug info
 1>RocketLib.lib(ir_function_detect_recursion.obj) : warning LNK4099: PDB 'hlslcc_64.pdb' was not found with 'RocketLib.lib(ir_function_detect_recursion.obj)' or at 'C:\Plabs\RocketUE4\SaxonRah\ParabolicLabs\Copy\Parabolic Labs\Project Trinity\Programmers\MyProject2\Binaries\Win64\hlslcc_64.pdb'; linking object as if no debug info
 1>RocketLib.lib(ir_function_can_inline.obj) : warning LNK4099: PDB 'hlslcc_64.pdb' was not found with 'RocketLib.lib(ir_function_can_inline.obj)' or at 'C:\Plabs\RocketUE4\SaxonRah\ParabolicLabs\Copy\Parabolic Labs\Project Trinity\Programmers\MyProject2\Binaries\Win64\hlslcc_64.pdb'; linking object as if no debug info
 1>RocketLib.lib(ir_function.obj) : warning LNK4099: PDB 'hlslcc_64.pdb' was not found with 'RocketLib.lib(ir_function.obj)' or at 'C:\Plabs\RocketUE4\SaxonRah\ParabolicLabs\Copy\Parabolic Labs\Project Trinity\Programmers\MyProject2\Binaries\Win64\hlslcc_64.pdb'; linking object as if no debug info
 1>RocketLib.lib(ir_constant_expression.obj) : warning LNK4099: PDB 'hlslcc_64.pdb' was not found with 'RocketLib.lib(ir_constant_expression.obj)' or at 'C:\Plabs\RocketUE4\SaxonRah\ParabolicLabs\Copy\Parabolic Labs\Project Trinity\Programmers\MyProject2\Binaries\Win64\hlslcc_64.pdb'; linking object as if no debug info
 1>RocketLib.lib(ir_clone.obj) : warning LNK4099: PDB 'hlslcc_64.pdb' was not found with 'RocketLib.lib(ir_clone.obj)' or at 'C:\Plabs\RocketUE4\SaxonRah\ParabolicLabs\Copy\Parabolic Labs\Project Trinity\Programmers\MyProject2\Binaries\Win64\hlslcc_64.pdb'; linking object as if no debug info
 1>RocketLib.lib(ir_basic_block.obj) : warning LNK4099: PDB 'hlslcc_64.pdb' was not found with 'RocketLib.lib(ir_basic_block.obj)' or at 'C:\Plabs\RocketUE4\SaxonRah\ParabolicLabs\Copy\Parabolic Labs\Project Trinity\Programmers\MyProject2\Binaries\Win64\hlslcc_64.pdb'; linking object as if no debug info
 1>RocketLib.lib(ir.obj) : warning LNK4099: PDB 'hlslcc_64.pdb' was not found with 'RocketLib.lib(ir.obj)' or at 'C:\Plabs\RocketUE4\SaxonRah\ParabolicLabs\Copy\Parabolic Labs\Project Trinity\Programmers\MyProject2\Binaries\Win64\hlslcc_64.pdb'; linking object as if no debug info
 1>RocketLib.lib(hlsl_parser.obj) : warning LNK4099: PDB 'hlslcc_64.pdb' was not found with 'RocketLib.lib(hlsl_parser.obj)' or at 'C:\Plabs\RocketUE4\SaxonRah\ParabolicLabs\Copy\Parabolic Labs\Project Trinity\Programmers\MyProject2\Binaries\Win64\hlslcc_64.pdb'; linking object as if no debug info
 1>RocketLib.lib(hlsl_lexer.obj) : warning LNK4099: PDB 'hlslcc_64.pdb' was not found with 'RocketLib.lib(hlsl_lexer.obj)' or at 'C:\Plabs\RocketUE4\SaxonRah\ParabolicLabs\Copy\Parabolic Labs\Project Trinity\Programmers\MyProject2\Binaries\Win64\hlslcc_64.pdb'; linking object as if no debug info
 1>RocketLib.lib(hir_field_selection.obj) : warning LNK4099: PDB 'hlslcc_64.pdb' was not found with 'RocketLib.lib(hir_field_selection.obj)' or at 'C:\Plabs\RocketUE4\SaxonRah\ParabolicLabs\Copy\Parabolic Labs\Project Trinity\Programmers\MyProject2\Binaries\Win64\hlslcc_64.pdb'; linking object as if no debug info
 1>RocketLib.lib(hash_table.obj) : warning LNK4099: PDB 'hlslcc_64.pdb' was not found with 'RocketLib.lib(hash_table.obj)' or at 'C:\Plabs\RocketUE4\SaxonRah\ParabolicLabs\Copy\Parabolic Labs\Project Trinity\Programmers\MyProject2\Binaries\Win64\hlslcc_64.pdb'; linking object as if no debug info
 1>RocketLib.lib(glsl_types.obj) : warning LNK4099: PDB 'hlslcc_64.pdb' was not found with 'RocketLib.lib(glsl_types.obj)' or at 'C:\Plabs\RocketUE4\SaxonRah\ParabolicLabs\Copy\Parabolic Labs\Project Trinity\Programmers\MyProject2\Binaries\Win64\hlslcc_64.pdb'; linking object as if no debug info
 1>RocketLib.lib(glsl_symbol_table.obj) : warning LNK4099: PDB 'hlslcc_64.pdb' was not found with 'RocketLib.lib(glsl_symbol_table.obj)' or at 'C:\Plabs\RocketUE4\SaxonRah\ParabolicLabs\Copy\Parabolic Labs\Project Trinity\Programmers\MyProject2\Binaries\Win64\hlslcc_64.pdb'; linking object as if no debug info
 1>RocketLib.lib(glsl_parser_extras.obj) : warning LNK4099: PDB 'hlslcc_64.pdb' was not found with 'RocketLib.lib(glsl_parser_extras.obj)' or at 'C:\Plabs\RocketUE4\SaxonRah\ParabolicLabs\Copy\Parabolic Labs\Project Trinity\Programmers\MyProject2\Binaries\Win64\hlslcc_64.pdb'; linking object as if no debug info
 1>RocketLib.lib(glcpp-parse.obj) : warning LNK4099: PDB 'hlslcc_64.pdb' was not found with 'RocketLib.lib(glcpp-parse.obj)' or at 'C:\Plabs\RocketUE4\SaxonRah\ParabolicLabs\Copy\Parabolic Labs\Project Trinity\Programmers\MyProject2\Binaries\Win64\hlslcc_64.pdb'; linking object as if no debug info
 1>RocketLib.lib(glcpp-lex.obj) : warning LNK4099: PDB 'hlslcc_64.pdb' was not found with 'RocketLib.lib(glcpp-lex.obj)' or at 'C:\Plabs\RocketUE4\SaxonRah\ParabolicLabs\Copy\Parabolic Labs\Project Trinity\Programmers\MyProject2\Binaries\Win64\hlslcc_64.pdb'; linking object as if no debug info
 1>RocketLib.lib(builtin_stubs.obj) : warning LNK4099: PDB 'hlslcc_64.pdb' was not found with 'RocketLib.lib(builtin_stubs.obj)' or at 'C:\Plabs\RocketUE4\SaxonRah\ParabolicLabs\Copy\Parabolic Labs\Project Trinity\Programmers\MyProject2\Binaries\Win64\hlslcc_64.pdb'; linking object as if no debug info
 1>RocketLib.lib(ast_type.obj) : warning LNK4099: PDB 'hlslcc_64.pdb' was not found with 'RocketLib.lib(ast_type.obj)' or at 'C:\Plabs\RocketUE4\SaxonRah\ParabolicLabs\Copy\Parabolic Labs\Project Trinity\Programmers\MyProject2\Binaries\Win64\hlslcc_64.pdb'; linking object as if no debug info
 1>RocketLib.lib(ast_to_hir.obj) : warning LNK4099: PDB 'hlslcc_64.pdb' was not found with 'RocketLib.lib(ast_to_hir.obj)' or at 'C:\Plabs\RocketUE4\SaxonRah\ParabolicLabs\Copy\Parabolic Labs\Project Trinity\Programmers\MyProject2\Binaries\Win64\hlslcc_64.pdb'; linking object as if no debug info
 1>RocketLib.lib(ast_function.obj) : warning LNK4099: PDB 'hlslcc_64.pdb' was not found with 'RocketLib.lib(ast_function.obj)' or at 'C:\Plabs\RocketUE4\SaxonRah\ParabolicLabs\Copy\Parabolic Labs\Project Trinity\Programmers\MyProject2\Binaries\Win64\hlslcc_64.pdb'; linking object as if no debug info
 1>RocketLib.lib(ast_expr.obj) : warning LNK4099: PDB 'hlslcc_64.pdb' was not found with 'RocketLib.lib(ast_expr.obj)' or at 'C:\Plabs\RocketUE4\SaxonRah\ParabolicLabs\Copy\Parabolic Labs\Project Trinity\Programmers\MyProject2\Binaries\Win64\hlslcc_64.pdb'; linking object as if no debug info
 1>RocketLib.lib(ir_track_image_access.obj) : warning LNK4099: PDB 'hlslcc_64.pdb' was not found with 'RocketLib.lib(ir_track_image_access.obj)' or at 'C:\Plabs\RocketUE4\SaxonRah\ParabolicLabs\Copy\Parabolic Labs\Project Trinity\Programmers\MyProject2\Binaries\Win64\hlslcc_64.pdb'; linking object as if no debug info
 1>RocketLib.lib(ir_gen_glsl.obj) : warning LNK4099: PDB 'hlslcc_64.pdb' was not found with 'RocketLib.lib(ir_gen_glsl.obj)' or at 'C:\Plabs\RocketUE4\SaxonRah\ParabolicLabs\Copy\Parabolic Labs\Project Trinity\Programmers\MyProject2\Binaries\Win64\hlslcc_64.pdb'; linking object as if no debug info
 1>RocketLib.lib(hlslcc.obj) : warning LNK4099: PDB 'hlslcc_64.pdb' was not found with 'RocketLib.lib(hlslcc.obj)' or at 'C:\Plabs\RocketUE4\SaxonRah\ParabolicLabs\Copy\Parabolic Labs\Project Trinity\Programmers\MyProject2\Binaries\Win64\hlslcc_64.pdb'; linking object as if no debug info
 1>RocketLib.lib(system.obj) : warning LNK4099: PDB 'mcpp_64.pdb' was not found with 'RocketLib.lib(system.obj)' or at 'C:\Plabs\RocketUE4\SaxonRah\ParabolicLabs\Copy\Parabolic Labs\Project Trinity\Programmers\MyProject2\Binaries\Win64\mcpp_64.pdb'; linking object as if no debug info
 1>RocketLib.lib(support.obj) : warning LNK4099: PDB 'mcpp_64.pdb' was not found with 'RocketLib.lib(support.obj)' or at 'C:\Plabs\RocketUE4\SaxonRah\ParabolicLabs\Copy\Parabolic Labs\Project Trinity\Programmers\MyProject2\Binaries\Win64\mcpp_64.pdb'; linking object as if no debug info
 1>RocketLib.lib(mbchar.obj) : warning LNK4099: PDB 'mcpp_64.pdb' was not found with 'RocketLib.lib(mbchar.obj)' or at 'C:\Plabs\RocketUE4\SaxonRah\ParabolicLabs\Copy\Parabolic Labs\Project Trinity\Programmers\MyProject2\Binaries\Win64\mcpp_64.pdb'; linking object as if no debug info
 1>RocketLib.lib(main.obj) : warning LNK4099: PDB 'mcpp_64.pdb' was not found with 'RocketLib.lib(main.obj)' or at 'C:\Plabs\RocketUE4\SaxonRah\ParabolicLabs\Copy\Parabolic Labs\Project Trinity\Programmers\MyProject2\Binaries\Win64\mcpp_64.pdb'; linking object as if no debug info
 1>RocketLib.lib(expand.obj) : warning LNK4099: PDB 'mcpp_64.pdb' was not found with 'RocketLib.lib(expand.obj)' or at 'C:\Plabs\RocketUE4\SaxonRah\ParabolicLabs\Copy\Parabolic Labs\Project Trinity\Programmers\MyProject2\Binaries\Win64\mcpp_64.pdb'; linking object as if no debug info
 1>RocketLib.lib(eval.obj) : warning LNK4099: PDB 'mcpp_64.pdb' was not found with 'RocketLib.lib(eval.obj)' or at 'C:\Plabs\RocketUE4\SaxonRah\ParabolicLabs\Copy\Parabolic Labs\Project Trinity\Programmers\MyProject2\Binaries\Win64\mcpp_64.pdb'; linking object as if no debug info
 1>RocketLib.lib(directive.obj) : warning LNK4099: PDB 'mcpp_64.pdb' was not found with 'RocketLib.lib(directive.obj)' or at 'C:\Plabs\RocketUE4\SaxonRah\ParabolicLabs\Copy\Parabolic Labs\Project Trinity\Programmers\MyProject2\Binaries\Win64\mcpp_64.pdb'; linking object as if no debug info
 1>RocketLib.lib(RecastRegion.obj) : warning LNK4099: PDB 'recast_64.pdb' was not found with 'RocketLib.lib(RecastRegion.obj)' or at 'C:\Plabs\RocketUE4\SaxonRah\ParabolicLabs\Copy\Parabolic Labs\Project Trinity\Programmers\MyProject2\Binaries\Win64\recast_64.pdb'; linking object as if no debug info
 1>RocketLib.lib(RecastRasterization.obj) : warning LNK4099: PDB 'recast_64.pdb' was not found with 'RocketLib.lib(RecastRasterization.obj)' or at 'C:\Plabs\RocketUE4\SaxonRah\ParabolicLabs\Copy\Parabolic Labs\Project Trinity\Programmers\MyProject2\Binaries\Win64\recast_64.pdb'; linking object as if no debug info
 1>RocketLib.lib(RecastLayers.obj) : warning LNK4099: PDB 'recast_64.pdb' was not found with 'RocketLib.lib(RecastLayers.obj)' or at 'C:\Plabs\RocketUE4\SaxonRah\ParabolicLabs\Copy\Parabolic Labs\Project Trinity\Programmers\MyProject2\Binaries\Win64\recast_64.pdb'; linking object as if no debug info
 1>RocketLib.lib(RecastFilter.obj) : warning LNK4099: PDB 'recast_64.pdb' was not found with 'RocketLib.lib(RecastFilter.obj)' or at 'C:\Plabs\RocketUE4\SaxonRah\ParabolicLabs\Copy\Parabolic Labs\Project Trinity\Programmers\MyProject2\Binaries\Win64\recast_64.pdb'; linking object as if no debug info
 1>RocketLib.lib(RecastArea.obj) : warning LNK4099: PDB 'recast_64.pdb' was not found with 'RocketLib.lib(RecastArea.obj)' or at 'C:\Plabs\RocketUE4\SaxonRah\ParabolicLabs\Copy\Parabolic Labs\Project Trinity\Programmers\MyProject2\Binaries\Win64\recast_64.pdb'; linking object as if no debug info
 1>RocketLib.lib(RecastAlloc.obj) : warning LNK4099: PDB 'recast_64.pdb' was not found with 'RocketLib.lib(RecastAlloc.obj)' or at 'C:\Plabs\RocketUE4\SaxonRah\ParabolicLabs\Copy\Parabolic Labs\Project Trinity\Programmers\MyProject2\Binaries\Win64\recast_64.pdb'; linking object as if no debug info
 1>RocketLib.lib(Recast.obj) : warning LNK4099: PDB 'recast_64.pdb' was not found with 'RocketLib.lib(Recast.obj)' or at 'C:\Plabs\RocketUE4\SaxonRah\ParabolicLabs\Copy\Parabolic Labs\Project Trinity\Programmers\MyProject2\Binaries\Win64\recast_64.pdb'; linking object as if no debug info
 1>RocketLib.lib(DetourNode.obj) : warning LNK4099: PDB 'recast_64.pdb' was not found with 'RocketLib.lib(DetourNode.obj)' or at 'C:\Plabs\RocketUE4\SaxonRah\ParabolicLabs\Copy\Parabolic Labs\Project Trinity\Programmers\MyProject2\Binaries\Win64\recast_64.pdb'; linking object as if no debug info
 1>RocketLib.lib(DetourNavMeshQuery.obj) : warning LNK4099: PDB 'recast_64.pdb' was not found with 'RocketLib.lib(DetourNavMeshQuery.obj)' or at 'C:\Plabs\RocketUE4\SaxonRah\ParabolicLabs\Copy\Parabolic Labs\Project Trinity\Programmers\MyProject2\Binaries\Win64\recast_64.pdb'; linking object as if no debug info
 1>RocketLib.lib(DetourNavMeshBuilder.obj) : warning LNK4099: PDB 'recast_64.pdb' was not found with 'RocketLib.lib(DetourNavMeshBuilder.obj)' or at 'C:\Plabs\RocketUE4\SaxonRah\ParabolicLabs\Copy\Parabolic Labs\Project Trinity\Programmers\MyProject2\Binaries\Win64\recast_64.pdb'; linking object as if no debug info
 1>RocketLib.lib(DetourNavMesh.obj) : warning LNK4099: PDB 'recast_64.pdb' was not found with 'RocketLib.lib(DetourNavMesh.obj)' or at 'C:\Plabs\RocketUE4\SaxonRah\ParabolicLabs\Copy\Parabolic Labs\Project Trinity\Programmers\MyProject2\Binaries\Win64\recast_64.pdb'; linking object as if no debug info
 1>RocketLib.lib(DetourCommon.obj) : warning LNK4099: PDB 'recast_64.pdb' was not found with 'RocketLib.lib(DetourCommon.obj)' or at 'C:\Plabs\RocketUE4\SaxonRah\ParabolicLabs\Copy\Parabolic Labs\Project Trinity\Programmers\MyProject2\Binaries\Win64\recast_64.pdb'; linking object as if no debug info
 1>RocketLib.lib(DetourAlloc.obj) : warning LNK4099: PDB 'recast_64.pdb' was not found with 'RocketLib.lib(DetourAlloc.obj)' or at 'C:\Plabs\RocketUE4\SaxonRah\ParabolicLabs\Copy\Parabolic Labs\Project Trinity\Programmers\MyProject2\Binaries\Win64\recast_64.pdb'; linking object as if no debug info
 1>RocketLib.lib(DetourTileCacheRegion.obj) : warning LNK4099: PDB 'recast_64.pdb' was not found with 'RocketLib.lib(DetourTileCacheRegion.obj)' or at 'C:\Plabs\RocketUE4\SaxonRah\ParabolicLabs\Copy\Parabolic Labs\Project Trinity\Programmers\MyProject2\Binaries\Win64\recast_64.pdb'; linking object as if no debug info
 1>RocketLib.lib(DetourTileCacheDetail.obj) : warning LNK4099: PDB 'recast_64.pdb' was not found with 'RocketLib.lib(DetourTileCacheDetail.obj)' or at 'C:\Plabs\RocketUE4\SaxonRah\ParabolicLabs\Copy\Parabolic Labs\Project Trinity\Programmers\MyProject2\Binaries\Win64\recast_64.pdb'; linking object as if no debug info
 1>RocketLib.lib(DetourTileCacheBuilder.obj) : warning LNK4099: PDB 'recast_64.pdb' was not found with 'RocketLib.lib(DetourTileCacheBuilder.obj)' or at 'C:\Plabs\RocketUE4\SaxonRah\ParabolicLabs\Copy\Parabolic Labs\Project Trinity\Programmers\MyProject2\Binaries\Win64\recast_64.pdb'; linking object as if no debug info
 1>RocketLib.lib(PxProfileEventImpl.obj) : warning LNK4099: PDB 'physxprofilesdkprofile.pdb' was not found with 'RocketLib.lib(PxProfileEventImpl.obj)' or at 'C:\Plabs\RocketUE4\SaxonRah\ParabolicLabs\Copy\Parabolic Labs\Project Trinity\Programmers\MyProject2\Binaries\Win64\physxprofilesdkprofile.pdb'; linking object as if no debug info
 1>RocketLib.lib(PvdNetworkStreams.obj) : warning LNK4099: PDB 'physxvisualdebuggersdkprofile.pdb' was not found with 'RocketLib.lib(PvdNetworkStreams.obj)' or at 'C:\Plabs\RocketUE4\SaxonRah\ParabolicLabs\Copy\Parabolic Labs\Project Trinity\Programmers\MyProject2\Binaries\Win64\physxvisualdebuggersdkprofile.pdb'; linking object as if no debug info
 1>RocketLib.lib(VehicleUtilTelemetry.obj) : warning LNK4099: PDB 'physx3vehicleprofile.pdb' was not found with 'RocketLib.lib(VehicleUtilTelemetry.obj)' or at 'C:\Plabs\RocketUE4\SaxonRah\ParabolicLabs\Copy\Parabolic Labs\Project Trinity\Programmers\MyProject2\Binaries\Win64\physx3vehicleprofile.pdb'; linking object as if no debug info
 1>RocketLib.lib(VehicleUtilSetup.obj) : warning LNK4099: PDB 'physx3vehicleprofile.pdb' was not found with 'RocketLib.lib(VehicleUtilSetup.obj)' or at 'C:\Plabs\RocketUE4\SaxonRah\ParabolicLabs\Copy\Parabolic Labs\Project Trinity\Programmers\MyProject2\Binaries\Win64\physx3vehicleprofile.pdb'; linking object as if no debug info
 1>RocketLib.lib(VehicleUtilControl.obj) : warning LNK4099: PDB 'physx3vehicleprofile.pdb' was not found with 'RocketLib.lib(VehicleUtilControl.obj)' or at 'C:\Plabs\RocketUE4\SaxonRah\ParabolicLabs\Copy\Parabolic Labs\Project Trinity\Programmers\MyProject2\Binaries\Win64\physx3vehicleprofile.pdb'; linking object as if no debug info
 1>RocketLib.lib(PxVehicleWheels.obj) : warning LNK4099: PDB 'physx3vehicleprofile.pdb' was not found with 'RocketLib.lib(PxVehicleWheels.obj)' or at 'C:\Plabs\RocketUE4\SaxonRah\ParabolicLabs\Copy\Parabolic Labs\Project Trinity\Programmers\MyProject2\Binaries\Win64\physx3vehicleprofile.pdb'; linking object as if no debug info
 1>RocketLib.lib(PxVehicleUpdate.obj) : warning LNK4099: PDB 'physx3vehicleprofile.pdb' was not found with 'RocketLib.lib(PxVehicleUpdate.obj)' or at 'C:\Plabs\RocketUE4\SaxonRah\ParabolicLabs\Copy\Parabolic Labs\Project Trinity\Programmers\MyProject2\Binaries\Win64\physx3vehicleprofile.pdb'; linking object as if no debug info
 1>RocketLib.lib(PxVehicleTireFriction.obj) : warning LNK4099: PDB 'physx3vehicleprofile.pdb' was not found with 'RocketLib.lib(PxVehicleTireFriction.obj)' or at 'C:\Plabs\RocketUE4\SaxonRah\ParabolicLabs\Copy\Parabolic Labs\Project Trinity\Programmers\MyProject2\Binaries\Win64\physx3vehicleprofile.pdb'; linking object as if no debug info
 1>RocketLib.lib(PxVehicleSuspWheelTire4.obj) : warning LNK4099: PDB 'physx3vehicleprofile.pdb' was not found with 'RocketLib.lib(PxVehicleSuspWheelTire4.obj)' or at 'C:\Plabs\RocketUE4\SaxonRah\ParabolicLabs\Copy\Parabolic Labs\Project Trinity\Programmers\MyProject2\Binaries\Win64\physx3vehicleprofile.pdb'; linking object as if no debug info
 1>RocketLib.lib(PxVehicleSDK.obj) : warning LNK4099: PDB 'physx3vehicleprofile.pdb' was not found with 'RocketLib.lib(PxVehicleSDK.obj)' or at 'C:\Plabs\RocketUE4\SaxonRah\ParabolicLabs\Copy\Parabolic Labs\Project Trinity\Programmers\MyProject2\Binaries\Win64\physx3vehicleprofile.pdb'; linking object as if no debug info
 1>RocketLib.lib(PxVehicleNoDrive.obj) : warning LNK4099: PDB 'physx3vehicleprofile.pdb' was not found with 'RocketLib.lib(PxVehicleNoDrive.obj)' or at 'C:\Plabs\RocketUE4\SaxonRah\ParabolicLabs\Copy\Parabolic Labs\Project Trinity\Programmers\MyProject2\Binaries\Win64\physx3vehicleprofile.pdb'; linking object as if no debug info
 1>RocketLib.lib(PxVehicleDriveTank.obj) : warning LNK4099: PDB 'physx3vehicleprofile.pdb' was not found with 'RocketLib.lib(PxVehicleDriveTank.obj)' or at 'C:\Plabs\RocketUE4\SaxonRah\ParabolicLabs\Copy\Parabolic Labs\Project Trinity\Programmers\MyProject2\Binaries\Win64\physx3vehicleprofile.pdb'; linking object as if no debug info
 1>RocketLib.lib(PxVehicleDrive4W.obj) : warning LNK4099: PDB 'physx3vehicleprofile.pdb' was not found with 'RocketLib.lib(PxVehicleDrive4W.obj)' or at 'C:\Plabs\RocketUE4\SaxonRah\ParabolicLabs\Copy\Parabolic Labs\Project Trinity\Programmers\MyProject2\Binaries\Win64\physx3vehicleprofile.pdb'; linking object as if no debug info
 1>RocketLib.lib(PxVehicleDrive.obj) : warning LNK4099: PDB 'physx3vehicleprofile.pdb' was not found with 'RocketLib.lib(PxVehicleDrive.obj)' or at 'C:\Plabs\RocketUE4\SaxonRah\ParabolicLabs\Copy\Parabolic Labs\Project Trinity\Programmers\MyProject2\Binaries\Win64\physx3vehicleprofile.pdb'; linking object as if no debug info
 1>RocketLib.lib(PxExtensionAutoGeneratedMetaDataObjects.obj) : warning LNK4099: PDB 'physx3extensionsprofile.pdb' was not found with 'RocketLib.lib(PxExtensionAutoGeneratedMetaDataObjects.obj)' or at 'C:\Plabs\RocketUE4\SaxonRah\ParabolicLabs\Copy\Parabolic Labs\Project Trinity\Programmers\MyProject2\Binaries\Win64\physx3extensionsprofile.pdb'; linking object as if no debug info
 1>RocketLib.lib(ExtVisualDebugger.obj) : warning LNK4099: PDB 'physx3extensionsprofile.pdb' was not found with 'RocketLib.lib(ExtVisualDebugger.obj)' or at 'C:\Plabs\RocketUE4\SaxonRah\ParabolicLabs\Copy\Parabolic Labs\Project Trinity\Programmers\MyProject2\Binaries\Win64\physx3extensionsprofile.pdb'; linking object as if no debug info
 1>RocketLib.lib(ExtSphericalJointSolverPrep.obj) : warning LNK4099: PDB 'physx3extensionsprofile.pdb' was not found with 'RocketLib.lib(ExtSphericalJointSolverPrep.obj)' or at 'C:\Plabs\RocketUE4\SaxonRah\ParabolicLabs\Copy\Parabolic Labs\Project Trinity\Programmers\MyProject2\Binaries\Win64\physx3extensionsprofile.pdb'; linking object as if no debug info
 1>RocketLib.lib(ExtSphericalJoint.obj) : warning LNK4099: PDB 'physx3extensionsprofile.pdb' was not found with 'RocketLib.lib(ExtSphericalJoint.obj)' or at 'C:\Plabs\RocketUE4\SaxonRah\ParabolicLabs\Copy\Parabolic Labs\Project Trinity\Programmers\MyProject2\Binaries\Win64\physx3extensionsprofile.pdb'; linking object as if no debug info
 1>RocketLib.lib(ExtRigidBodyExt.obj) : warning LNK4099: PDB 'physx3extensionsprofile.pdb' was not found with 'RocketLib.lib(ExtRigidBodyExt.obj)' or at 'C:\Plabs\RocketUE4\SaxonRah\ParabolicLabs\Copy\Parabolic Labs\Project Trinity\Programmers\MyProject2\Binaries\Win64\physx3extensionsprofile.pdb'; linking object as if no debug info
 1>RocketLib.lib(ExtRevoluteJointSolverPrep.obj) : warning LNK4099: PDB 'physx3extensionsprofile.pdb' was not found with 'RocketLib.lib(ExtRevoluteJointSolverPrep.obj)' or at 'C:\Plabs\RocketUE4\SaxonRah\ParabolicLabs\Copy\Parabolic Labs\Project Trinity\Programmers\MyProject2\Binaries\Win64\physx3extensionsprofile.pdb'; linking object as if no debug info
 1>RocketLib.lib(ExtRevoluteJoint.obj) : warning LNK4099: PDB 'physx3extensionsprofile.pdb' was not found with 'RocketLib.lib(ExtRevoluteJoint.obj)' or at 'C:\Plabs\RocketUE4\SaxonRah\ParabolicLabs\Copy\Parabolic Labs\Project Trinity\Programmers\MyProject2\Binaries\Win64\physx3extensionsprofile.pdb'; linking object as if no debug info
 1>RocketLib.lib(ExtPvdClientImpl.obj) : warning LNK4099: PDB 'physx3extensionsprofile.pdb' was not found with 'RocketLib.lib(ExtPvdClientImpl.obj)' or at 'C:\Plabs\RocketUE4\SaxonRah\ParabolicLabs\Copy\Parabolic Labs\Project Trinity\Programmers\MyProject2\Binaries\Win64\physx3extensionsprofile.pdb'; linking object as if no debug info
 1>RocketLib.lib(ExtPrismaticJointSolverPrep.obj) : warning LNK4099: PDB 'physx3extensionsprofile.pdb' was not found with 'RocketLib.lib(ExtPrismaticJointSolverPrep.obj)' or at 'C:\Plabs\RocketUE4\SaxonRah\ParabolicLabs\Copy\Parabolic Labs\Project Trinity\Programmers\MyProject2\Binaries\Win64\physx3extensionsprofile.pdb'; linking object as if no debug info
 1>RocketLib.lib(ExtPrismaticJoint.obj) : warning LNK4099: PDB 'physx3extensionsprofile.pdb' was not found with 'RocketLib.lib(ExtPrismaticJoint.obj)' or at 'C:\Plabs\RocketUE4\SaxonRah\ParabolicLabs\Copy\Parabolic Labs\Project Trinity\Programmers\MyProject2\Binaries\Win64\physx3extensionsprofile.pdb'; linking object as if no debug info
 1>RocketLib.lib(ExtMetaData.obj) : warning LNK4099: PDB 'physx3extensionsprofile.pdb' was not found with 'RocketLib.lib(ExtMetaData.obj)' or at 'C:\Plabs\RocketUE4\SaxonRah\ParabolicLabs\Copy\Parabolic Labs\Project Trinity\Programmers\MyProject2\Binaries\Win64\physx3extensionsprofile.pdb'; linking object as if no debug info
 1>RocketLib.lib(ExtJoint.obj) : warning LNK4099: PDB 'physx3extensionsprofile.pdb' was not found with 'RocketLib.lib(ExtJoint.obj)' or at 'C:\Plabs\RocketUE4\SaxonRah\ParabolicLabs\Copy\Parabolic Labs\Project Trinity\Programmers\MyProject2\Binaries\Win64\physx3extensionsprofile.pdb'; linking object as if no debug info
 1>RocketLib.lib(ExtFixedJointSolverPrep.obj) : warning LNK4099: PDB 'physx3extensionsprofile.pdb' was not found with 'RocketLib.lib(ExtFixedJointSolverPrep.obj)' or at 'C:\Plabs\RocketUE4\SaxonRah\ParabolicLabs\Copy\Parabolic Labs\Project Trinity\Programmers\MyProject2\Binaries\Win64\physx3extensionsprofile.pdb'; linking object as if no debug info
 1>RocketLib.lib(ExtFixedJoint.obj) : warning LNK4099: PDB 'physx3extensionsprofile.pdb' was not found with 'RocketLib.lib(ExtFixedJoint.obj)' or at 'C:\Plabs\RocketUE4\SaxonRah\ParabolicLabs\Copy\Parabolic Labs\Project Trinity\Programmers\MyProject2\Binaries\Win64\physx3extensionsprofile.pdb'; linking object as if no debug info
 1>RocketLib.lib(ExtExtensions.obj) : warning LNK4099: PDB 'physx3extensionsprofile.pdb' was not found with 'RocketLib.lib(ExtExtensions.obj)' or at 'C:\Plabs\RocketUE4\SaxonRah\ParabolicLabs\Copy\Parabolic Labs\Project Trinity\Programmers\MyProject2\Binaries\Win64\physx3extensionsprofile.pdb'; linking object as if no debug info
 1>RocketLib.lib(ExtDistanceJointSolverPrep.obj) : warning LNK4099: PDB 'physx3extensionsprofile.pdb' was not found with 'RocketLib.lib(ExtDistanceJointSolverPrep.obj)' or at 'C:\Plabs\RocketUE4\SaxonRah\ParabolicLabs\Copy\Parabolic Labs\Project Trinity\Programmers\MyProject2\Binaries\Win64\physx3extensionsprofile.pdb'; linking object as if no debug info
 1>RocketLib.lib(ExtDistanceJoint.obj) : warning LNK4099: PDB 'physx3extensionsprofile.pdb' was not found with 'RocketLib.lib(ExtDistanceJoint.obj)' or at 'C:\Plabs\RocketUE4\SaxonRah\ParabolicLabs\Copy\Parabolic Labs\Project Trinity\Programmers\MyProject2\Binaries\Win64\physx3extensionsprofile.pdb'; linking object as if no debug info
 1>RocketLib.lib(ExtD6JointSolverPrep.obj) : warning LNK4099: PDB 'physx3extensionsprofile.pdb' was not found with 'RocketLib.lib(ExtD6JointSolverPrep.obj)' or at 'C:\Plabs\RocketUE4\SaxonRah\ParabolicLabs\Copy\Parabolic Labs\Project Trinity\Programmers\MyProject2\Binaries\Win64\physx3extensionsprofile.pdb'; linking object as if no debug info
 1>RocketLib.lib(ExtD6Joint.obj) : warning LNK4099: PDB 'physx3extensionsprofile.pdb' was not found with 'RocketLib.lib(ExtD6Joint.obj)' or at 'C:\Plabs\RocketUE4\SaxonRah\ParabolicLabs\Copy\Parabolic Labs\Project Trinity\Programmers\MyProject2\Binaries\Win64\physx3extensionsprofile.pdb'; linking object as if no debug info
 1>RocketLib.lib(frontend.obj) : warning LNK4099: PDB 'tbbmalloc.pdb' was not found with 'RocketLib.lib(frontend.obj)' or at 'C:\Plabs\RocketUE4\SaxonRah\ParabolicLabs\Copy\Parabolic Labs\Project Trinity\Programmers\MyProject2\Binaries\Win64\tbbmalloc.pdb'; linking object as if no debug info
 1>RocketLib.lib(tbbmalloc.obj) : warning LNK4099: PDB 'tbbmalloc.pdb' was not found with 'RocketLib.lib(tbbmalloc.obj)' or at 'C:\Plabs\RocketUE4\SaxonRah\ParabolicLabs\Copy\Parabolic Labs\Project Trinity\Programmers\MyProject2\Binaries\Win64\tbbmalloc.pdb'; linking object as if no debug info
 1>RocketLib.lib(backref.obj) : warning LNK4099: PDB 'tbbmalloc.pdb' was not found with 'RocketLib.lib(backref.obj)' or at 'C:\Plabs\RocketUE4\SaxonRah\ParabolicLabs\Copy\Parabolic Labs\Project Trinity\Programmers\MyProject2\Binaries\Win64\tbbmalloc.pdb'; linking object as if no debug info
 1>RocketLib.lib(large_objects.obj) : warning LNK4099: PDB 'tbbmalloc.pdb' was not found with 'RocketLib.lib(large_objects.obj)' or at 'C:\Plabs\RocketUE4\SaxonRah\ParabolicLabs\Copy\Parabolic Labs\Project Trinity\Programmers\MyProject2\Binaries\Win64\tbbmalloc.pdb'; linking object as if no debug info
 1>RocketLib.lib(backend.obj) : warning LNK4099: PDB 'tbbmalloc.pdb' was not found with 'RocketLib.lib(backend.obj)' or at 'C:\Plabs\RocketUE4\SaxonRah\ParabolicLabs\Copy\Parabolic Labs\Project Trinity\Programmers\MyProject2\Binaries\Win64\tbbmalloc.pdb'; linking object as if no debug info
 1>RocketLib.lib(plzo1x_99.obj) : warning LNK4099: PDB 'lzopro_64.pdb' was not found with 'RocketLib.lib(plzo1x_99.obj)' or at 'C:\Plabs\RocketUE4\SaxonRah\ParabolicLabs\Copy\Parabolic Labs\Project Trinity\Programmers\MyProject2\Binaries\Win64\lzopro_64.pdb'; linking object as if no debug info
 1>RocketLib.lib(plzo1x_1n.obj) : warning LNK4099: PDB 'lzopro_64.pdb' was not found with 'RocketLib.lib(plzo1x_1n.obj)' or at 'C:\Plabs\RocketUE4\SaxonRah\ParabolicLabs\Copy\Parabolic Labs\Project Trinity\Programmers\MyProject2\Binaries\Win64\lzopro_64.pdb'; linking object as if no debug info
 1>RocketLib.lib(plzo1x_1h.obj) : warning LNK4099: PDB 'lzopro_64.pdb' was not found with 'RocketLib.lib(plzo1x_1h.obj)' or at 'C:\Plabs\RocketUE4\SaxonRah\ParabolicLabs\Copy\Parabolic Labs\Project Trinity\Programmers\MyProject2\Binaries\Win64\lzopro_64.pdb'; linking object as if no debug info
 1>RocketLib.lib(pinit.obj) : warning LNK4099: PDB 'lzopro_64.pdb' was not found with 'RocketLib.lib(pinit.obj)' or at 'C:\Plabs\RocketUE4\SaxonRah\ParabolicLabs\Copy\Parabolic Labs\Project Trinity\Programmers\MyProject2\Binaries\Win64\lzopro_64.pdb'; linking object as if no debug info
 1>RocketLib.lib(lzo_str.obj) : warning LNK4099: PDB 'lzopro_64.pdb' was not found with 'RocketLib.lib(lzo_str.obj)' or at 'C:\Plabs\RocketUE4\SaxonRah\ParabolicLabs\Copy\Parabolic Labs\Project Trinity\Programmers\MyProject2\Binaries\Win64\lzopro_64.pdb'; linking object as if no debug info
 1>RocketLib.lib(lzo_init.obj) : warning LNK4099: PDB 'lzopro_64.pdb' was not found with 'RocketLib.lib(lzo_init.obj)' or at 'C:\Plabs\RocketUE4\SaxonRah\ParabolicLabs\Copy\Parabolic Labs\Project Trinity\Programmers\MyProject2\Binaries\Win64\lzopro_64.pdb'; linking object as if no debug info
 1>RocketLib.lib(lzo1x_d4s.obj) : warning LNK4099: PDB 'lzopro_64.pdb' was not found with 'RocketLib.lib(lzo1x_d4s.obj)' or at 'C:\Plabs\RocketUE4\SaxonRah\ParabolicLabs\Copy\Parabolic Labs\Project Trinity\Programmers\MyProject2\Binaries\Win64\lzopro_64.pdb'; linking object as if no debug info
 1>  -------- End Detailed Actions Stats -----------------------------------------------------------
 1>  Cumulative action seconds (6 processors): 0.00 building projects, 23.95 compiling, 0.00 creating app bundles, 0.00 generating debug info, 18.16 linking, 0.00 other
 1>  UBT execution time: 47.96 seconds
 ========== Build: 1 succeeded, 0 failed, 0 up-to-date, 0 skipped ==========
 
Product Version: Not Selected
Tags:
more ▼

asked Mar 11 '14 at 02:26 AM in C++ Programming

avatar image

ue4-archive ♦♦ STAFF
49.9k 3665 1991 9119

avatar image ue4-archive ♦♦ STAFF Mar 11 '14 at 02:26 AM

not sure if this is any help, but i don't think your project can be in the same folder as the rocket install. think you might need admin rights personally i use this set up D:Rocket for the editor E:RocketGames for the examples C:\Users\Geodav\Documents\Rocket Projects for my test projects

avatar image ue4-archive ♦♦ STAFF Mar 11 '14 at 02:26 AM

According to the output his project folder is:

C:\Plabs\RocketUE4\SaxonRah\ParabolicLabs\Copy\Parabolic Labs\Project Trinity\Programmers\MyProject2

(so it shouldn't be that). :)

(comments are locked)
10|2000 characters needed characters left
Viewable by all users

5 answers: sort voted first

Rocket still will not compile any C++. So we decided to reboot the drive. We Re-installed Windows7x64, VS2012 w/Update4, and a bunch of updates for windows then finally Rocket, in that order and now everything works and compiles like it should. I have no clue why Rocket Beta 4 worked fine but the update to Beta 5 broke the C++ Compilation.

more ▼

answered Mar 11 '14 at 02:26 AM

avatar image

ue4-archive ♦♦ STAFF
49.9k 3665 1991 9119

(comments are locked)
10|2000 characters needed characters left
Viewable by all users

Change your build configuration (it's a drop down menu at the top of the IDE by default) from "Debug" to "Debug Editor".

more ▼

answered Mar 11 '14 at 02:26 AM

avatar image

ue4-archive ♦♦ STAFF
49.9k 3665 1991 9119

avatar image ue4-archive ♦♦ STAFF Mar 11 '14 at 02:26 AM
 ------ Build started: Project: MyProject, Configuration: Debug_Editor x64 ------
   Parsing headers for MyProjectEditor
   Code generation finished for MyProjectEditor and took 3.028
   rc.exe MyProject.rc
   Module.MyProject.cpp
 C:\Plabs\RocketUE4\SaxonRah\ParabolicLabs\Copy\Parabolic Labs\Project Trinity\Programmers\MyProject\Source\MyProject\Resources\Windows\MyProject.rc(11): fatal error RC1015: cannot open include file 'windows.h'.
   
 C:\Program Files\Rocket\Engine\Source\Runtime\Core\Public\HAL\PlatformIncludes.h(10): fatal error C1083: Cannot open include file: 'new': No such file or directory
   -------- End Detailed Actions Stats -----------------------------------------------------------
 ERROR : UBT error : Failed to produce item: C:\Plabs\RocketUE4\SaxonRah\ParabolicLabs\Copy\Parabolic Labs\Project Trinity\Programmers\MyProject\Binaries\Win64\RocketEditor-MyProject-Win64-Debug.dll
   Cumulative action seconds (6 processors): 0.00 building projects, 0.33 compiling, 0.00 creating app bundles, 0.00 generating debug info, 0.00 linking, 0.00 other
   UBT execution time: 7.25 seconds
 C:\Program Files (x86)\MSBuild\Microsoft.Cpp\v4.0\V110\Microsoft.MakeFile.Targets(38,5): error MSB3073: The command ""C:\Program Files\Rocket\Engine\Binaries\DotNET\UnrealBuildTool.exe" MyProjectEditor Win64 Debug "C:\Plabs\RocketUE4\SaxonRah\ParabolicLabs\Copy\Parabolic Labs\Project Trinity\Programmers\MyProject\MyProject.uproject" -rocket" exited with code 1.
 ========== Build: 0 succeeded, 1 failed, 0 up-to-date, 0 skipped ==========




I get this now

avatar image ue4-archive ♦♦ STAFF Mar 11 '14 at 02:26 AM

It says that for any C++ project

avatar image ue4-archive ♦♦ STAFF Mar 11 '14 at 02:26 AM

Can you compile ANYTHING that isn't Rocket-based? Because those headers are standard includes that should have been installed along with Visual Studio.

Of course, they probably WERE installed but for some reason your include path is set up incorrectly...

avatar image ue4-archive ♦♦ STAFF Mar 11 '14 at 02:26 AM

Yeah, all normal projects compile just fine and have been compiling fine for awhile now. Just randomly I was getting these errors. I fixed the include path and everything is working as intended! Thanks Neil

avatar image ue4-archive ♦♦ STAFF Mar 11 '14 at 02:27 AM

I also have this exact same problem. The only difference is am on Windows 8 x64.

avatar image ue4-archive ♦♦ STAFF Mar 11 '14 at 02:27 AM +

Well, in the words of Shark Tank/Dragon's Den - "I'm out".

Somebody from Epic is going to have to help you - I have no idea what is causing this issue for you! The only thing I can suggest trying is moving the location of the project to somewhere else on your HD that results in a shorter path. I don't think it will help though - but that's about the last suggestion I can make!

avatar image ue4-archive ♦♦ STAFF Mar 11 '14 at 02:27 AM

Thanks for all your help. Hopefully someone at Epic knows whats wrong. Thanks again, Cheers!

(comments are locked)
10|2000 characters needed characters left
Viewable by all users

I am having the same issue as well. IS there any solution aside from reinstalling the entire operating system, which is way too much ?

My thread is here : https://answers.unrealengine.com/questions/12743/why-does-my-project-not-build-cannot-find-windowsh.html#answer-14031

more ▼

answered Mar 21 '14 at 11:26 AM

avatar image

StrangerGwenn
594 53 63 132

(comments are locked)
10|2000 characters needed characters left
Viewable by all users

By any chance, does your Windows user name has special chars ? That was the problem on my computer. UAT is sensitive to that.

more ▼

answered Mar 21 '14 at 04:09 PM

avatar image

StrangerGwenn
594 53 63 132

(comments are locked)
10|2000 characters needed characters left
Viewable by all users

Same problem here, so far I reinstall visual studio, make a new folder for the unreal with the source + optional +required files, all clean and nice.. I Compile the engine in Developer Editor - Win 64... Compiles just fine without any errors.. so, I run the Unreal Editor and I choose a new "Third Person Game C++", unreal makes the project files and open Visual Studio again.. without touching any code, I Choose in my solutions configuration "Debug Editor - Win 64 - MyCustomGame" hit build.. but i get the same errors..

In my previous installation of Visual Studio I tried EVERY build configuration ( "Debug", "Debug Editor", etc) but always the same error.. I have visual studio 2013 + Windows 8.1 x64.

EDIT: Is working for me now! I reinstall visual studio in my C: drive (I had it in F: drive before) and I deleted all the visual studio folders from my documents (I have 2 very old folders there from visual studio 2008 and 2010 )

more ▼

answered Mar 21 '14 at 04:06 PM

avatar image

RS
111 1 3 5

(comments are locked)
10|2000 characters needed characters left
Viewable by all users
Your answer
toggle preview:

Up to 5 attachments (including images) can be used with a maximum of 5.2 MB each and 5.2 MB total.

Follow this question

Once you sign in you will be able to subscribe for any updates here

Answers to this question