x

Search in
Sort by:

Question Status:

Search help

  • Simple searches use one or more words. Separate the words with spaces (cat dog) to search cat,dog or both. Separate the words with plus signs (cat +dog) to search for items that may contain cat but must contain dog.
  • You can further refine your search on the search results page, where you can search by keywords, author, topic. These can be combined with each other. Examples
    • cat dog --matches anything with cat,dog or both
    • cat +dog --searches for cat +dog where dog is a mandatory term
    • cat -dog -- searches for cat excluding any result containing dog
    • [cats] —will restrict your search to results with topic named "cats"
    • [cats] [dogs] —will restrict your search to results with both topics, "cats", and "dogs"

PackagingResults:Error: Error Launch failed! Unknown Error

Someone knows what is the solution for this error?

LogPlayLevel: Launcher Device ID: Android_ATC@0a23c00d LogPlayLevel: PlayLevel: No blueprints needed recompiling LogStats:Warning: MetaData mismatch. Did you assign a stat to two groups? New //STATGROUP_Threads//FLauncherTask///Thread_2374_0///####STATCAT_Advanced#### old //STATGROUP_Threads//FLauncherTask///Thread_2300_0///####STATCAT_Advanced#### LogStats:Warning: MetaData mismatch. Did you assign a stat to two groups? New //STATGROUP_Threads//LauncherWorker///Thread_2384_0///####STATCAT_Advanced#### old //STATGROUP_Threads//LauncherWorker///Thread_2818_0///####STATCAT_Advanced#### LogChunkManifestGenerator: Updated collection PackagesRemovedFromChunk0 LogChunkManifestGenerator: Chunk: 0, Started with 451 packages, Final after dependency resolve: 451 LogChunkManifestGenerator:Display: Saving asset registry. LogChunkManifestGenerator:Display: Generated asset registry num assets 318, size is 71.70kb LogChunkManifestGenerator:Display: Done saving asset registry. LogCook:Display: Cook by the book total time in tick 0.000014s total time 1.572320 LogStats:Warning: MetaData mismatch. Did you assign a stat to two groups? New //STATGROUP_Threads//FLauncherTask///Thread_2378_0///####STATCAT_Advanced#### old //STATGROUP_Threads//FLauncherTask///Thread_2300_0///####STATCAT_Advanced#### LogPlayLevel: Completed Launch On Stage: Cooking in the editor, Time: 0.000024 LogStats:Warning: MetaData mismatch. Did you assign a stat to two groups? New //STATGROUP_Threads//FLauncherTask///Thread_15a4_0///####STATCAT_Advanced#### old //STATGROUP_Threads//FLauncherTask///Thread_2300_0///####STATCAT_Advanced#### LogPlayLevel: Running AutomationTool... LogPlayLevel: Program.Main: 2016-07-23T19:06:17.8412292Z: Running on WindowsHostPlatform as a 64-bit process. LogPlayLevel: Automation.ParseCommandLine: Parsing command line: -ScriptsForProject=C:/Users/bruno/Documents/Bruno/Servicos/AplicativoAgendall/Arquivos/UNREAL/Agendall/Agendall.uproject BuildCookRun -project=C:/Users/bruno/Documents/Bruno/Servicos/AplicativoAgendall/Arquivos/UNREAL/Agendall/Agendall.uproject -noP4 -clientconfig=Development -serverconfig=Deve lopment -nocompile -nocompileeditor -installed -ue4exe=UE4Editor-Cmd.exe -utf8output -platform=Android_ATC -targetplatform=Android -cookflavor=ATC -build -map=/Game/Maps/Agendall -skipcook -iterativecooking -compressed -iterativedeploy -stage -deploy -cmdline=/Game/Maps/Agendall -Messaging -device=Android_ATC@0a23c00d -addcmdline=-SessionId=E30C02364000D37D5 216709672048955 -SessionOwner='bruno' -SessionName='Launch On Device' -run LogPlayLevel: Automation.Process: Setting up command environment. LogPlayLevel: Automation.Process: Compiling scripts. LogPlayLevel: BuildCookRun.SetupParams: Setting up ProjectParams for C:\Users\bruno\Documents\Bruno\Servicos\AplicativoAgendall\Arquivos\UNREAL\Agendall\Agendall.uproject LogPlayLevel: Project.Build: BUILD COMMAND STARTED LogPlayLevel: Completed Launch On Stage: Build Task, Time: 0.752029 LogStats:Warning: MetaData mismatch. Did you assign a stat to two groups? New //STATGROUP_Threads//FLauncherTask///Thread_1a48_0///####STATCAT_Advanced#### old //STATGROUP_Threads//FLauncherTask///Thread_2300_0///####STATCAT_Advanced#### LogPlayLevel: CommandUtils.Run: Run: C:\Program Files\Epic Games\4.11\Engine\Binaries\DotNET\UnrealBuildTool.exe Agendall Android Development -Project=C:\Users\bruno\Documents\Bruno\Servicos\AplicativoAgendall\Arquivos\UNREAL\Agendall\Agendall.uproject C:\Users\bruno\Documents\Bruno\Servicos\AplicativoAgendall\Arquivos\UNREAL\Agendall\Agendall.uproject -re moteini="C:\Users\bruno\Documents\Bruno\Servicos\AplicativoAgendall\Arquivos\UNREAL\Agendall" -noxge -generatemanifest -NoHotReloadFromIDE LogPlayLevel: UnrealBuildTool: NDK version: 19, GccVersion: 4.8 LogPlayLevel: CommandUtils.Run: Run: Took 0,9029235s to run UnrealBuildTool.exe, ExitCode=0 LogPlayLevel: CommandUtils.Run: Run: C:\Program Files\Epic Games\4.11\Engine\Binaries\DotNET\UnrealBuildTool.exe Agendall Android Development -Project=C:\Users\bruno\Documents\Bruno\Servicos\AplicativoAgendall\Arquivos\UNREAL\Agendall\Agendall.uproject C:\Users\bruno\Documents\Bruno\Servicos\AplicativoAgendall\Arquivos\UNREAL\Agendall\Agendall.uproject -re moteini="C:\Users\bruno\Documents\Bruno\Servicos\AplicativoAgendall\Arquivos\UNREAL\Agendall" -noxge -NoHotReloadFromIDE -ignorejunk LogPlayLevel: UnrealBuildTool: Performing 1 actions (4 in parallel) LogPlayLevel: Completed Launch On Stage: Build Task, Time: 6.523561 LogPlayLevel: Launcher Device ID: Android_ATC@0a23c00d LogPlayLevel: PlayLevel: No blueprints needed recompiling LogStats:Warning: MetaData mismatch. Did you assign a stat to two groups? New //STATGROUP_Threads//FLauncherTask///Thread_2920_0///####STATCAT_Advanced#### old //STATGROUP_Threads//FLauncherTask///Thread_2300_0///####STATCAT_Advanced#### LogStats:Warning: MetaData mismatch. Did you assign a stat to two groups? New //STATGROUP_Threads//LauncherWorker///Thread_2940_0///####STATCAT_Advanced#### old //STATGROUP_Threads//LauncherWorker///Thread_2818_0///####STATCAT_Advanced#### LogChunkManifestGenerator: Updated collection PackagesRemovedFromChunk0 LogChunkManifestGenerator: Chunk: 0, Started with 451 packages, Final after dependency resolve: 451 LogChunkManifestGenerator:Display: Saving asset registry. LogChunkManifestGenerator:Display: Generated asset registry num assets 318, size is 71.70kb LogChunkManifestGenerator:Display: Done saving asset registry. LogCook:Display: Cook by the book total time in tick 0.000013s total time 1.653185 LogStats:Warning: MetaData mismatch. Did you assign a stat to two groups? New //STATGROUP_Threads//FLauncherTask///Thread_26d4_0///####STATCAT_Advanced#### old //STATGROUP_Threads//FLauncherTask///Thread_2300_0///####STATCAT_Advanced#### LogPlayLevel: Completed Launch On Stage: Cooking in the editor, Time: 0.000037 LogStats:Warning: MetaData mismatch. Did you assign a stat to two groups? New //STATGROUP_Threads//FLauncherTask///Thread_2760_0///####STATCAT_Advanced#### old //STATGROUP_Threads//FLauncherTask///Thread_2300_0///####STATCAT_Advanced#### LogPlayLevel: Running AutomationTool... LogPlayLevel: Program.Main: 2016-07-23T19:06:32.2145941Z: Running on WindowsHostPlatform as a 64-bit process. LogPlayLevel: Automation.ParseCommandLine: Parsing command line: -ScriptsForProject=C:/Users/bruno/Documents/Bruno/Servicos/AplicativoAgendall/Arquivos/UNREAL/Agendall/Agendall.uproject BuildCookRun -project=C:/Users/bruno/Documents/Bruno/Servicos/AplicativoAgendall/Arquivos/UNREAL/Agendall/Agendall.uproject -noP4 -clientconfig=Development -serverconfig=Deve lopment -nocompile -nocompileeditor -installed -ue4exe=UE4Editor-Cmd.exe -utf8output -platform=Android_ATC -targetplatform=Android -cookflavor=ATC -build -map=/Game/Maps/Agendall -skipcook -iterativecooking -compressed -iterativedeploy -stage -deploy -cmdline=/Game/Maps/Agendall -Messaging -device=Android_ATC@0a23c00d -addcmdline=-SessionId=E30C02364000D37D5 216709672048955 -SessionOwner='bruno' -SessionName='Launch On Device' -run LogPlayLevel: Automation.Process: Setting up command environment. LogPlayLevel: Automation.Process: Compiling scripts. LogPlayLevel: BuildCookRun.SetupParams: Setting up ProjectParams for C:\Users\bruno\Documents\Bruno\Servicos\AplicativoAgendall\Arquivos\UNREAL\Agendall\Agendall.uproject LogPlayLevel: Project.Build: BUILD COMMAND STARTED LogPlayLevel: Completed Launch On Stage: Build Task, Time: 0.751921 LogStats:Warning: MetaData mismatch. Did you assign a stat to two groups? New //STATGROUP_Threads//FLauncherTask///Thread_2b98_0///####STATCAT_Advanced#### old //STATGROUP_Threads//FLauncherTask///Thread_2300_0///####STATCAT_Advanced#### LogPlayLevel: CommandUtils.Run: Run: C:\Program Files\Epic Games\4.11\Engine\Binaries\DotNET\UnrealBuildTool.exe Agendall Android Development -Project=C:\Users\bruno\Documents\Bruno\Servicos\AplicativoAgendall\Arquivos\UNREAL\Agendall\Agendall.uproject C:\Users\bruno\Documents\Bruno\Servicos\AplicativoAgendall\Arquivos\UNREAL\Agendall\Agendall.uproject -re moteini="C:\Users\bruno\Documents\Bruno\Servicos\AplicativoAgendall\Arquivos\UNREAL\Agendall" -noxge -generatemanifest -NoHotReloadFromIDE LogPlayLevel: UnrealBuildTool: NDK version: 19, GccVersion: 4.8 LogPlayLevel: CommandUtils.Run: Run: Took 0,9039292s to run UnrealBuildTool.exe, ExitCode=0 LogPlayLevel: CommandUtils.Run: Run: C:\Program Files\Epic Games\4.11\Engine\Binaries\DotNET\UnrealBuildTool.exe Agendall Android Development -Project=C:\Users\bruno\Documents\Bruno\Servicos\AplicativoAgendall\Arquivos\UNREAL\Agendall\Agendall.uproject C:\Users\bruno\Documents\Bruno\Servicos\AplicativoAgendall\Arquivos\UNREAL\Agendall\Agendall.uproject -re moteini="C:\Users\bruno\Documents\Bruno\Servicos\AplicativoAgendall\Arquivos\UNREAL\Agendall" -noxge -NoHotReloadFromIDE -ignorejunk LogPlayLevel: UnrealBuildTool: Performing 1 actions (4 in parallel) LogPlayLevel: UnrealBuildTool: [1/1] clang++.exe Agendall-armv7-es2.so LogPlayLevel: UnrealBuildTool: C:\Users\bruno\Documents\Bruno\Servicos\AplicativoAgendall\Arquivos\UNREAL\Agendall\Plugins\SQLite3UE4Plugin\Source\SQLite3UE4Plugin\Private/SQLiteDatabase.cpp:199: error: undefined reference to 'sqlite3_open' LogPlayLevel: UnrealBuildTool: C:\Users\bruno\Documents\Bruno\Servicos\AplicativoAgendall\Arquivos\UNREAL\Agendall\Plugins\SQLite3UE4Plugin\Source\SQLite3UE4Plugin\Private/SQLiteDatabase.cpp:201: error: undefined reference to 'sqlite3_close' LogPlayLevel: UnrealBuildTool: C:\Users\bruno\Documents\Bruno\Servicos\AplicativoAgendall\Arquivos\UNREAL\Agendall\Plugins\SQLite3UE4Plugin\Source\SQLite3UE4Plugin\Private/SQLiteDatabase.cpp:199: error: undefined reference to 'sqlite3_open' LogPlayLevel: UnrealBuildTool: C:\Users\bruno\Documents\Bruno\Servicos\AplicativoAgendall\Arquivos\UNREAL\Agendall\Plugins\SQLite3UE4Plugin\Source\SQLite3UE4Plugin\Private/SQLiteDatabase.cpp:201: error: undefined reference to 'sqlite3_close' LogPlayLevel: UnrealBuildTool: C:\Users\bruno\Documents\Bruno\Servicos\AplicativoAgendall\Arquivos\UNREAL\Agendall\Plugins\SQLite3UE4Plugin\Source\SQLite3UE4Plugin\Private/SQLiteDatabase.cpp:199: error: undefined reference to 'sqlite3_open' LogPlayLevel: UnrealBuildTool: C:\Users\bruno\Documents\Bruno\Servicos\AplicativoAgendall\Arquivos\UNREAL\Agendall\Plugins\SQLite3UE4Plugin\Source\SQLite3UE4Plugin\Private/SQLiteDatabase.cpp:201: error: undefined reference to 'sqlite3_close' LogPlayLevel: UnrealBuildTool: C:\Users\bruno\Documents\Bruno\Servicos\AplicativoAgendall\Arquivos\UNREAL\Agendall\Plugins\SQLite3UE4Plugin\Source\SQLite3UE4Plugin\Private/SQLiteDatabase.cpp:534: error: undefined reference to 'sqlite3_errmsg' LogPlayLevel: UnrealBuildTool: C:\Users\bruno\Documents\Bruno\Servicos\AplicativoAgendall\Arquivos\UNREAL\Agendall\Plugins\SQLite3UE4Plugin\Source\SQLite3UE4Plugin\Private/SQLiteDatabase.cpp:551: error: undefined reference to 'sqlite3_step' LogPlayLevel: UnrealBuildTool: C:\Users\bruno\Documents\Bruno\Servicos\AplicativoAgendall\Arquivos\UNREAL\Agendall\Plugins\SQLite3UE4Plugin\Source\SQLite3UE4Plugin\Private/SQLiteDatabase.cpp:558: error: undefined reference to 'sqlite3_column_count' LogPlayLevel: UnrealBuildTool: C:\Users\bruno\Documents\Bruno\Servicos\AplicativoAgendall\Arquivos\UNREAL\Agendall\Plugins\SQLite3UE4Plugin\Source\SQLite3UE4Plugin\Private/SQLiteDatabase.cpp:561: error: undefined reference to 'sqlite3_column_type' LogPlayLevel: UnrealBuildTool: C:\Users\bruno\Documents\Bruno\Servicos\AplicativoAgendall\Arquivos\UNREAL\Agendall\Plugins\SQLite3UE4Plugin\Source\SQLite3UE4Plugin\Private/SQLiteDatabase.cpp:562: error: undefined reference to 'sqlite3_column_name' LogPlayLevel: UnrealBuildTool: C:\Users\bruno\Documents\Bruno\Servicos\AplicativoAgendall\Arquivos\UNREAL\Agendall\Plugins\SQLite3UE4Plugin\Source\SQLite3UE4Plugin\Private/SQLiteDatabase.cpp:578: error: undefined reference to 'sqlite3_column_double' LogPlayLevel: UnrealBuildTool: C:\Users\bruno\Documents\Bruno\Servicos\AplicativoAgendall\Arquivos\UNREAL\Agendall\Plugins\SQLite3UE4Plugin\Source\SQLite3UE4Plugin\Private/SQLiteDatabase.cpp:574: error: undefined reference to 'sqlite3_column_text' LogPlayLevel: UnrealBuildTool: C:\Users\bruno\Documents\Bruno\Servicos\AplicativoAgendall\Arquivos\UNREAL\Agendall\Plugins\SQLite3UE4Plugin\Source\SQLite3UE4Plugin\Private/SQLiteDatabase.cpp:570: error: undefined reference to 'sqlite3_column_int64' LogPlayLevel: UnrealBuildTool: C:\Users\bruno\Documents\Bruno\Servicos\AplicativoAgendall\Arquivos\UNREAL\Agendall\Plugins\SQLite3UE4Plugin\Source\SQLite3UE4Plugin\Private/SQLiteDatabase.cpp:553: error: undefined reference to 'sqlite3_step' LogPlayLevel: UnrealBuildTool: C:\Users\bruno\Documents\Bruno\Servicos\AplicativoAgendall\Arquivos\UNREAL\Agendall\Plugins\SQLite3UE4Plugin\Source\SQLite3UE4Plugin\Private/SQLiteDatabase.cpp:598: error: undefined reference to 'sqlite3_finalize' LogPlayLevel: UnrealBuildTool: C:\Users\bruno\Documents\Bruno\Servicos\AplicativoAgendall\Arquivos\UNREAL\Agendall\Plugins\SQLite3UE4Plugin\Source\SQLite3UE4Plugin\Private/SQLiteDatabase.cpp:599: error: undefined reference to 'sqlite3_close' LogPlayLevel: UnrealBuildTool: C:\Users\bruno\Documents\Bruno\Servicos\AplicativoAgendall\Arquivos\UNREAL\Agendall\Plugins\SQLite3UE4Plugin\Source\SQLite3UE4Plugin\Private/SQLiteDatabase.cpp:540: error: undefined reference to 'sqlite3_finalize' LogPlayLevel: UnrealBuildTool: C:\Users\bruno\Documents\Bruno\Servicos\AplicativoAgendall\Arquivos\UNREAL\Agendall\Plugins\SQLite3UE4Plugin\Source\SQLite3UE4Plugin\Private/SQLiteDatabase.cpp:348: error: undefined reference to 'sqlite3_open' LogPlayLevel: UnrealBuildTool: C:\Users\bruno\Documents\Bruno\Servicos\AplicativoAgendall\Arquivos\UNREAL\Agendall\Plugins\SQLite3UE4Plugin\Source\SQLite3UE4Plugin\Private/SQLiteDatabase.cpp:354: error: undefined reference to 'sqlite3_prepare_v2' LogPlayLevel: UnrealBuildTool: C:\Users\bruno\Documents\Bruno\Servicos\AplicativoAgendall\Arquivos\UNREAL\Agendall\Plugins\SQLite3UE4Plugin\Source\SQLite3UE4Plugin\Private/SQLiteDatabase.cpp:438: error: undefined reference to 'sqlite3_exec' LogPlayLevel: UnrealBuildTool: clang++.exe: error: linker command failed with exit code 1 (use -v to see invocation) LogPlayLevel: UnrealBuildTool: -------- End Detailed Actions Stats ----------------------------------------------------------- LogPlayLevel: UnrealBuildTool: ERROR: UBT ERROR: Failed to produce item: C:\Users\bruno\Documents\Bruno\Servicos\AplicativoAgendall\Arquivos\UNREAL\Agendall\Binaries\Android\Agendall-armv7-es2.so LogPlayLevel: UnrealBuildTool: Total build time: 22,37 seconds LogPlayLevel: CommandUtils.Run: Run: Took 22,5062016s to run UnrealBuildTool.exe, ExitCode=5 LogPlayLevel: Program.Main: ERROR: AutomationTool terminated with exception: AutomationTool.AutomationException: Command failed (Result:5): C:\Program Files\Epic Games\4.11\Engine\Binaries\DotNET\UnrealBuildTool.exe Agendall Android Development -Project=C:\Users\bruno\Documents\Bruno\Servicos\AplicativoAgendall\Arquivos\UNREAL\Agendall\Agendall.uproject C:\ Users\bruno\Documents\Bruno\Servicos\AplicativoAgendall\Arquivos\UNREAL\Agendall\Agendall.uproject -remoteini="C:\Users\bruno\Documents\Bruno\Servicos\AplicativoAgendall\Arquivos\UNREAL\Agendall" -noxge -NoHotReloadFromIDE -ignorejunk. See logfile for details: 'UnrealBuildTool-2016.07.23-16.06.33.txt' LogPlayLevel: em AutomationTool.CommandUtils.RunAndLog(String App, String CommandLine, String Logfile, Int32 MaxSuccessCode, String Input, ERunOptions Options, Dictionary`2 EnvVars) LogPlayLevel: em AutomationTool.CommandUtils.RunUBT(CommandEnvironment Env, String UBTExecutable, String CommandLine, String LogName, Dictionary`2 EnvVars) LogPlayLevel: em AutomationTool.UE4Build.BuildWithUBT(String TargetName, UnrealTargetPlatform TargetPlatform, String Config, FileReference UprojectPath, Boolean ForceMonolithic, Boolean ForceNonUnity, Boolean ForceDebugInfo, Boolean ForceFlushMac, Boolean DisableXGE, String InAddArgs, Boolean ForceUnity, Dictionary`2 EnvVars) LogPlayLevel: em AutomationTool.UE4Build.Build(BuildAgenda Agenda, Nullable`1 InDeleteBuildProducts, Boolean InUpdateVersionFiles, Boolean InForceNoXGE, Boolean InUseParallelExecutor, Boolean InForceNonUnity, Boolean InForceUnity, Boolean InShowProgress, Dictionary`2 PlatformEnvVars) LogPlayLevel: em Project.Build(BuildCommand Command, ProjectParams Params, Int32 WorkingCL, ProjectBuildTargets TargetMask) LogPlayLevel: em BuildCookRun.DoBuildCookRun(ProjectParams Params) LogPlayLevel: em AutomationTool.BuildCommand.Execute() LogPlayLevel: em AutomationTool.Automation.Execute(List`1 CommandsToExecute, CaselessDictionary`1 Commands) LogPlayLevel: em AutomationTool.Automation.Process(String[] CommandLine) LogPlayLevel: em AutomationTool.Program.MainProc(Object Param) LogPlayLevel: em AutomationTool.InternalUtils.RunSingleInstance(Func`2 Main, Object Param) LogPlayLevel: em AutomationTool.Program.Main() LogPlayLevel: Program.Main: AutomationTool exiting with ExitCode=5 (5) LogPlayLevel: Domain_ProcessExit LogPlayLevel: copying UAT log files... LogPlayLevel: Completed Launch On Stage: Build Task, Time: 23.016159 LogPlayLevel: BUILD FAILED PackagingResults:Error: Error Launch failed! Unknown Error

Product Version: UE 4.12
Tags:
more ▼

asked Jul 23 '16 at 07:10 PM in Packaging & Deployment

avatar image

BrunoChaves
136 10 7 13

avatar image dogu189 Jul 23 '16 at 07:15 PM

I can help but can you upload this log as a file?

(comments are locked)
10|2000 characters needed characters left

2 answers: sort voted first

I´ve found out!

It´s one of the plug-ins.

Just disabled and worked!

more ▼

answered Jul 23 '16 at 08:43 PM

avatar image

BrunoChaves
136 10 7 13

(comments are locked)
10|2000 characters needed characters left

As I look through your log there seems to be issue with sqlite3 not having a reference, Thats probably mistake you made when referencing sqlite3 in blueprint I suggest you take a look to the blueprint that include sqlite3(and the ones with sqlite3_open,sqlite3_finaliaze,sqlite3_column_double, etc...)

more ▼

answered Jul 23 '16 at 07:20 PM

avatar image

dogu189
23 10 15 19

avatar image dogu189 Jul 23 '16 at 07:29 PM

Sorry, I meant; sqlite3 has a reference which is undefined

(comments are locked)
10|2000 characters needed characters left
Your answer
toggle preview:

Up to 5 attachments (including images) can be used with a maximum of 5.2 MB each and 5.2 MB total.

Follow this question

Once you sign in you will be able to subscribe for any updates here

Answers to this question