x

Search in
Sort by:

Question Status:

Search help

  • Simple searches use one or more words. Separate the words with spaces (cat dog) to search cat,dog or both. Separate the words with plus signs (cat +dog) to search for items that may contain cat but must contain dog.
  • You can further refine your search on the search results page, where you can search by keywords, author, topic. These can be combined with each other. Examples
    • cat dog --matches anything with cat,dog or both
    • cat +dog --searches for cat +dog where dog is a mandatory term
    • cat -dog -- searches for cat excluding any result containing dog
    • [cats] —will restrict your search to results with topic named "cats"
    • [cats] [dogs] —will restrict your search to results with both topics, "cats", and "dogs"

Build package failed in 4.14

When I upgrade 4.14, the package failed.

UE4Editor-Cmd: [2016.12.09-06.06.46:089][ 0]LogApexClothingUtils:Warning: Building adjacency information for a clothing section in skeletal mesh '/Game/Meshs/SkeletonMeshs/Strong/SK_S01_H009.SK_S01_H009'. Please resave the asset. UE4Editor-Cmd: [2016.12.09-06.06.46:426][ 0]LogApexClothingUtils:Warning: Building adjacency information for a clothing section in skeletal mesh '/Game/Meshs/SkeletonMeshs/Strong/SK_S01_H004.SK_S01_H004'. Please resave the asset. UE4Editor-Cmd: [2016.12.09-06.07.47:310][ 0]LogWindows:Error: begin: stack for UAT UE4Editor-Cmd: [2016.12.09-06.07.47:313][ 0]LogWindows:Error: === Critical error: === UE4Editor-Cmd: [2016.12.09-06.07.47:323][ 0]LogWindows:Error: UE4Editor-Cmd: [2016.12.09-06.07.47:333][ 0]LogWindows:Error: Assertion failed: TriNorm.SizeSquared() > SMALL_NUMBER && "Collinear points in FMath::ComputeBaryCentric2D()" [File:D:\Build\++UE4+Release-4.14+Compile\Sync\Engine\Source\Runtime\Core\Private\Math\UnrealMath.cpp] [Line: 1976] UE4Editor-Cmd: [2016.12.09-06.07.47:343][ 0]LogWindows:Error: UE4Editor-Cmd: [2016.12.09-06.07.47:353][ 0]LogWindows:Error: UE4Editor-Cmd: [2016.12.09-06.07.47:363][ 0]LogWindows:Error: UE4Editor-Cmd: [2016.12.09-06.07.47:373][ 0]LogWindows:Error: UE4Editor-Cmd: [2016.12.09-06.07.47:383][ 0]LogWindows:Error: end: stack for UAT CommandUtils.Run: Run: Took 1210.2702235s to run UE4Editor-Cmd.exe, ExitCode=3 InternalUtils.SafeCopyFile: SafeCopyFile F:\UE4\4.14\Engine\Programs\AutomationTool\Saved\Cook-2016.12.09-13.47.51.txt C:\Users\new\AppData\Roaming\Unreal Engine\AutomationTool\Logs\F+UE4+4.14\Cook-2016.12.09-14.08.01.txt InternalUtils.SafeDeleteFile: SafeDeleteFile F:\UE4\4.14\Engine\Programs\AutomationTool\Saved\Cook-2016.12.09-13.47.51.txt Project.Cook: Cook failed. Deleting cooked data. Program.Main: ERROR: AutomationTool terminated with exception: AutomationTool.AutomationException: Cook failed. ---> AutomationTool.AutomationException: BUILD FAILED: Failed while running Cook for D:\CS3_dabao\CS3.uproject; see log C:\Users\new\AppData\Roaming\Unreal Engine\AutomationTool\Logs\F+UE4+4.14\Cook-2016.12.09-14.08.01.txt 在 AutomationTool.CommandUtils.RunCommandlet(FileReference ProjectName, String UE4Exe, String Commandlet, String Parameters) 在 AutomationTool.CommandUtils.CookCommandlet(FileReference ProjectName, String UE4Exe, String[] Maps, String[] Dirs, String InternationalizationPreset, String[] CulturesToCook, String TargetPlatform, String Parameters) 在 Project.Cook(ProjectParams Params) --- 内部异常堆栈跟踪的结尾 --- 在 Project.Cook(ProjectParams Params) 在 BuildCookRun.DoBuildCookRun(ProjectParams Params) 在 AutomationTool.BuildCommand.Execute() 在 AutomationTool.Automation.Execute(List`1 CommandsToExecute, CaselessDictionary`1 Commands) 在 AutomationTool.Automation.Process(String[] Arguments) 在 AutomationTool.Program.MainProc(Object Param) 在 AutomationTool.InternalUtils.RunSingleInstance(Func`2 Main, Object Param) 在 AutomationTool.Program.Main() Program.Main: AutomationTool exiting with ExitCode=25 (Error_UnknownCookFailure)alt text

Product Version: UE 4.14
Tags:
more ▼

asked Dec 09 '16 at 09:45 AM in Packaging & Deployment

avatar image

Shuang Liu
1 1 1

avatar image Samantha Sutton ♦♦ STAFF Dec 14 '16 at 04:14 PM

Shuang Liu,

Please delete your Intermediate and Saved folders from your project folder and try to package again. Please then copy and paste your whole error output log to a .txt file and upload it with your next reply.

Thank you!

(comments are locked)
10|2000 characters needed characters left
Viewable by all users

1 answer: sort voted first

Hey Shuang Liu,

We have not heard back from you in a few days, so we are marking this post as Resolved for tracking purposes. If you are still experiencing the issue you reported, please respond to this message with additional information and we will offer further assistance.

Thank you!

more ▼

answered Dec 19 '16 at 04:10 PM

(comments are locked)
10|2000 characters needed characters left
Viewable by all users
Your answer
toggle preview:

Up to 5 attachments (including images) can be used with a maximum of 5.2 MB each and 5.2 MB total.

Follow this question

Once you sign in you will be able to subscribe for any updates here

Answers to this question