x

Search in
Sort by:

Question Status:

Search help

  • Simple searches use one or more words. Separate the words with spaces (cat dog) to search cat,dog or both. Separate the words with plus signs (cat +dog) to search for items that may contain cat but must contain dog.
  • You can further refine your search on the search results page, where you can search by keywords, author, topic. These can be combined with each other. Examples
    • cat dog --matches anything with cat,dog or both
    • cat +dog --searches for cat +dog where dog is a mandatory term
    • cat -dog -- searches for cat excluding any result containing dog
    • [cats] —will restrict your search to results with topic named "cats"
    • [cats] [dogs] —will restrict your search to results with both topics, "cats", and "dogs"

Error while building Apex

I am trying to integrate Apex to my project. I am following this guide for building from source.

https://wiki.unrealengine.com/PhysX_Source_Guide

Every step worked fine until I was building apex and I got these errors.

And integrating PhysX to my project is not working as well. Are these error stopping me from integrating PhysX?

 1>------ Build started: Project: APEX_Destructible, Configuration: debug x64 ------
 1>  CompoundCreatorBase.cpp
 1>  ConvexBase.cpp
 1>  MeshBase.cpp
 1>C:\Program Files (x86)\Microsoft Visual Studio 14.0\VC\include\limits(1115): error C3861: '__builtin_huge_valf': identifier not found (compiling source file A:\Work\4.15\Engine\Source\ThirdParty\PhysX\APEX_1.4\module\destructible\fracture\Core\MeshBase.cpp)
 1>C:\Program Files (x86)\Microsoft Visual Studio 14.0\VC\include\limits(1120): error C3861: '__builtin_nanf': identifier not found (compiling source file A:\Work\4.15\Engine\Source\ThirdParty\PhysX\APEX_1.4\module\destructible\fracture\Core\MeshBase.cpp)
 1>C:\Program Files (x86)\Microsoft Visual Studio 14.0\VC\include\limits(1125): error C3861: '__builtin_nansf': identifier not found (compiling source file A:\Work\4.15\Engine\Source\ThirdParty\PhysX\APEX_1.4\module\destructible\fracture\Core\MeshBase.cpp)
 1>C:\Program Files (x86)\Microsoft Visual Studio 14.0\VC\include\limits(1115): error C3861: '__builtin_huge_valf': identifier not found (compiling source file A:\Work\4.15\Engine\Source\ThirdParty\PhysX\APEX_1.4\module\destructible\fracture\Core\CompoundCreatorBase.cpp)
 1>C:\Program Files (x86)\Microsoft Visual Studio 14.0\VC\include\limits(1120): error C3861: '__builtin_nanf': identifier not found (compiling source file A:\Work\4.15\Engine\Source\ThirdParty\PhysX\APEX_1.4\module\destructible\fracture\Core\CompoundCreatorBase.cpp)
 1>C:\Program Files (x86)\Microsoft Visual Studio 14.0\VC\include\limits(1178): error C3861: '__builtin_huge_val': identifier not found (compiling source file A:\Work\4.15\Engine\Source\ThirdParty\PhysX\APEX_1.4\module\destructible\fracture\Core\MeshBase.cpp)
 1>C:\Program Files (x86)\Microsoft Visual Studio 14.0\VC\include\limits(1125): error C3861: '__builtin_nansf': identifier not found (compiling source file A:\Work\4.15\Engine\Source\ThirdParty\PhysX\APEX_1.4\module\destructible\fracture\Core\CompoundCreatorBase.cpp)
 1>C:\Program Files (x86)\Microsoft Visual Studio 14.0\VC\include\limits(1183): error C3861: '__builtin_nan': identifier not found (compiling source file A:\Work\4.15\Engine\Source\ThirdParty\PhysX\APEX_1.4\module\destructible\fracture\Core\MeshBase.cpp)
 1>C:\Program Files (x86)\Microsoft Visual Studio 14.0\VC\include\limits(1188): error C3861: '__builtin_nans': identifier not found (compiling source file A:\Work\4.15\Engine\Source\ThirdParty\PhysX\APEX_1.4\module\destructible\fracture\Core\MeshBase.cpp)
 1>C:\Program Files (x86)\Microsoft Visual Studio 14.0\VC\include\limits(1178): error C3861: '__builtin_huge_val': identifier not found (compiling source file A:\Work\4.15\Engine\Source\ThirdParty\PhysX\APEX_1.4\module\destructible\fracture\Core\CompoundCreatorBase.cpp)
 1>C:\Program Files (x86)\Microsoft Visual Studio 14.0\VC\include\limits(1183): error C3861: '__builtin_nan': identifier not found (compiling source file A:\Work\4.15\Engine\Source\ThirdParty\PhysX\APEX_1.4\module\destructible\fracture\Core\CompoundCreatorBase.cpp)
 1>C:\Program Files (x86)\Microsoft Visual Studio 14.0\VC\include\limits(1188): error C3861: '__builtin_nans': identifier not found (compiling source file A:\Work\4.15\Engine\Source\ThirdParty\PhysX\APEX_1.4\module\destructible\fracture\Core\CompoundCreatorBase.cpp)
 1>C:\Program Files (x86)\Microsoft Visual Studio 14.0\VC\include\limits(1241): error C3861: '__builtin_huge_val': identifier not found (compiling source file A:\Work\4.15\Engine\Source\ThirdParty\PhysX\APEX_1.4\module\destructible\fracture\Core\MeshBase.cpp)
 1>C:\Program Files (x86)\Microsoft Visual Studio 14.0\VC\include\limits(1241): error C3861: '__builtin_huge_val': identifier not found (compiling source file A:\Work\4.15\Engine\Source\ThirdParty\PhysX\APEX_1.4\module\destructible\fracture\Core\CompoundCreatorBase.cpp)
 1>C:\Program Files (x86)\Microsoft Visual Studio 14.0\VC\include\limits(1246): error C3861: '__builtin_nan': identifier not found (compiling source file A:\Work\4.15\Engine\Source\ThirdParty\PhysX\APEX_1.4\module\destructible\fracture\Core\MeshBase.cpp)
 1>C:\Program Files (x86)\Microsoft Visual Studio 14.0\VC\include\limits(1246): error C3861: '__builtin_nan': identifier not found (compiling source file A:\Work\4.15\Engine\Source\ThirdParty\PhysX\APEX_1.4\module\destructible\fracture\Core\CompoundCreatorBase.cpp)
 1>C:\Program Files (x86)\Microsoft Visual Studio 14.0\VC\include\limits(1251): error C3861: '__builtin_nans': identifier not found (compiling source file A:\Work\4.15\Engine\Source\ThirdParty\PhysX\APEX_1.4\module\destructible\fracture\Core\MeshBase.cpp)
 1>C:\Program Files (x86)\Microsoft Visual Studio 14.0\VC\include\limits(1251): error C3861: '__builtin_nans': identifier not found (compiling source file A:\Work\4.15\Engine\Source\ThirdParty\PhysX\APEX_1.4\module\destructible\fracture\Core\CompoundCreatorBase.cpp)
 1>C:\Program Files (x86)\Microsoft Visual Studio 14.0\VC\include\limits(1115): error C3861: '__builtin_huge_valf': identifier not found (compiling source file A:\Work\4.15\Engine\Source\ThirdParty\PhysX\APEX_1.4\module\destructible\fracture\Core\ConvexBase.cpp)
 1>C:\Program Files (x86)\Microsoft Visual Studio 14.0\VC\include\limits(1120): error C3861: '__builtin_nanf': identifier not found (compiling source file A:\Work\4.15\Engine\Source\ThirdParty\PhysX\APEX_1.4\module\destructible\fracture\Core\ConvexBase.cpp)
 1>C:\Program Files (x86)\Microsoft Visual Studio 14.0\VC\include\limits(1125): error C3861: '__builtin_nansf': identifier not found (compiling source file A:\Work\4.15\Engine\Source\ThirdParty\PhysX\APEX_1.4\module\destructible\fracture\Core\ConvexBase.cpp)
 1>C:\Program Files (x86)\Microsoft Visual Studio 14.0\VC\include\limits(1178): error C3861: '__builtin_huge_val': identifier not found (compiling source file A:\Work\4.15\Engine\Source\ThirdParty\PhysX\APEX_1.4\module\destructible\fracture\Core\ConvexBase.cpp)
 1>C:\Program Files (x86)\Microsoft Visual Studio 14.0\VC\include\limits(1183): error C3861: '__builtin_nan': identifier not found (compiling source file A:\Work\4.15\Engine\Source\ThirdParty\PhysX\APEX_1.4\module\destructible\fracture\Core\ConvexBase.cpp)
 1>C:\Program Files (x86)\Microsoft Visual Studio 14.0\VC\include\limits(1188): error C3861: '__builtin_nans': identifier not found (compiling source file A:\Work\4.15\Engine\Source\ThirdParty\PhysX\APEX_1.4\module\destructible\fracture\Core\ConvexBase.cpp)
 1>C:\Program Files (x86)\Microsoft Visual Studio 14.0\VC\include\limits(1241): error C3861: '__builtin_huge_val': identifier not found (compiling source file A:\Work\4.15\Engine\Source\ThirdParty\PhysX\APEX_1.4\module\destructible\fracture\Core\ConvexBase.cpp)
 1>C:\Program Files (x86)\Microsoft Visual Studio 14.0\VC\include\limits(1246): error C3861: '__builtin_nan': identifier not found (compiling source file A:\Work\4.15\Engine\Source\ThirdParty\PhysX\APEX_1.4\module\destructible\fracture\Core\ConvexBase.cpp)
 1>C:\Program Files (x86)\Microsoft Visual Studio 14.0\VC\include\limits(1251): error C3861: '__builtin_nans': identifier not found (compiling source file A:\Work\4.15\Engine\Source\ThirdParty\PhysX\APEX_1.4\module\destructible\fracture\Core\ConvexBase.cpp)
 2>------ Build started: Project: APEX_Loader, Configuration: debug x64 ------
 2>LINK : fatal error LNK1104: cannot open file 'A:\Work\4.15\Engine\Source\ThirdParty\PhysX\Lib\Win64\VS2015\APEX_DestructibleDEBUG_x64.lib'
 ========== Build: 0 succeeded, 2 failed, 26 up-to-date, 0 skipped ==========
Product Version: UE 4.15
Tags:
more ▼

asked Apr 14 '17 at 01:41 AM in C++ Programming

avatar image

envenger
418 76 116 145

(comments are locked)
10|2000 characters needed characters left

0 answers: sort voted first
Be the first one to answer this question
toggle preview:

Up to 5 attachments (including images) can be used with a maximum of 5.2 MB each and 5.2 MB total.

Follow this question

Once you sign in you will be able to subscribe for any updates here

Answers to this question