x

Search in
Sort by:

Question Status:

Search help

  • Simple searches use one or more words. Separate the words with spaces (cat dog) to search cat,dog or both. Separate the words with plus signs (cat +dog) to search for items that may contain cat but must contain dog.
  • You can further refine your search on the search results page, where you can search by keywords, author, topic. These can be combined with each other. Examples
    • cat dog --matches anything with cat,dog or both
    • cat +dog --searches for cat +dog where dog is a mandatory term
    • cat -dog -- searches for cat excluding any result containing dog
    • [cats] —will restrict your search to results with topic named "cats"
    • [cats] [dogs] —will restrict your search to results with both topics, "cats", and "dogs"

Android Build Error

Hello! I'm trying to follow with Google VR guide (https://docs.unrealengine.com/latest/INT/Platforms/GoogleVR/QuickStart/1/index.html) And when I'm trying to build Android package I've got an error.

 UATHelper: Packaging (Android (ASTC)): Running AutomationTool...
 UATHelper: Packaging (Android (ASTC)): Automation.ParseCommandLine: Parsing command line: -ScriptsForProject=D:/UnrealProjects/test2/test2/test2.uproject BuildCookRun -nocompile -nocompileeditor -installed -nop4 -project=D:/UnrealProjects/test2/test2/test2.uproject -cook -stage -archive -archivedirectory=D:/AndroidBuild -package -clientconfig=Development -ue
 4exe=UE4Editor-Cmd.exe -pak -prereqs -nodebuginfo -targetplatform=Android -cookflavor=ASTC -build -utf8output
 UATHelper: Packaging (Android (ASTC)): BuildCookRun.SetupParams: Setting up ProjectParams for D:\UnrealProjects\test2\test2\test2.uproject
 UATHelper: Packaging (Android (ASTC)): Project.Build: ********** BUILD COMMAND STARTED **********
 UATHelper: Packaging (Android (ASTC)): CommandUtils.Run: Run: D:\Program Files\Epic Games\UE_4.16\Engine\Binaries\DotNET\UnrealBuildTool.exe test2 Android Development -Project=D:\UnrealProjects\test2\test2\test2.uproject  D:\UnrealProjects\test2\test2\test2.uproject -NoUBTMakefiles  -remoteini="D:\UnrealProjects\test2\test2" -noxge -generatemanifest -NoHotRe
 load
 UATHelper: Packaging (Android (ASTC)): UnrealBuildTool: NDK version: 24, GccVersion: 4.9
 UATHelper: Packaging (Android (ASTC)): CommandUtils.Run: Run: Took 0,9937065s to run UnrealBuildTool.exe, ExitCode=0
 UATHelper: Packaging (Android (ASTC)): CommandUtils.Run: Run: D:\Program Files\Epic Games\UE_4.16\Engine\Binaries\DotNET\UnrealBuildTool.exe test2 Android Development -Project=D:\UnrealProjects\test2\test2\test2.uproject  D:\UnrealProjects\test2\test2\test2.uproject -NoUBTMakefiles  -remoteini="D:\UnrealProjects\test2\test2" -noxge -NoHotReload -ignorejunk
 UATHelper: Packaging (Android (ASTC)): UnrealBuildTool: NDK version: 24, GccVersion: 4.9
 UATHelper: Packaging (Android (ASTC)): UnrealBuildTool: Compiling Native code with NDK API 'android-24'
 UATHelper: Packaging (Android (ASTC)): UnrealBuildTool: Target is up to date
 UATHelper: Packaging (Android (ASTC)): UnrealBuildTool: Deploying test2 Android Development...
 UATHelper: Packaging (Android (ASTC)): UnrealBuildTool: Receipt Filename: D:\UnrealProjects\test2\test2\Binaries\Android\test2.target
 UATHelper: Packaging (Android (ASTC)): UnrealBuildTool: AndroidPlugin: Plugins\Runtime\AndroidPermission\Source\AndroidPermission\AndroidPermission_APL.xml
 UATHelper: Packaging (Android (ASTC)): UnrealBuildTool: AndroidPlugin: Plugins\Runtime\GearVR\Source\GearVR\GearVR_APL.xml
 UATHelper: Packaging (Android (ASTC)): UnrealBuildTool: AndroidPlugin: Plugins\Runtime\GearVR\Source\GearVRController\GearVRController_APL.xml
 UATHelper: Packaging (Android (ASTC)): UnrealBuildTool: AndroidPlugin: Plugins\Runtime\GoogleCloudMessaging\Source\GoogleCloudMessaging\GoogleCloudMessaging_UPL.xml
 UATHelper: Packaging (Android (ASTC)): UnrealBuildTool: AndroidPlugin: Plugins\Runtime\GoogleVR\GoogleVRHMD\Source\GoogleVRHMD\GoogleVRHMD_APL.xml
 UATHelper: Packaging (Android (ASTC)): UnrealBuildTool: AndroidPlugin: Source\Runtime\Online\Voice\AndroidVoiceImpl_UPL.xml
 UATHelper: Packaging (Android (ASTC)): UnrealBuildTool: 
 UATHelper: Packaging (Android (ASTC)): UnrealBuildTool: UPL: ..\Plugins/Runtime/AndroidPermission/Source/AndroidPermission/AndroidPermission_APL.xml
 UATHelper: Packaging (Android (ASTC)): UnrealBuildTool: 
 UATHelper: Packaging (Android (ASTC)): UnrealBuildTool: UPL: ..\Plugins/Runtime/GearVR/Source/GearVR/GearVR_APL.xml
 UATHelper: Packaging (Android (ASTC)): UnrealBuildTool: 
 UATHelper: Packaging (Android (ASTC)): UnrealBuildTool: UPL: ..\Plugins/Runtime/GearVR/Source/GearVRController/GearVRController_APL.xml
 UATHelper: Packaging (Android (ASTC)): UnrealBuildTool: 
 UATHelper: Packaging (Android (ASTC)): UnrealBuildTool: UPL: ..\Plugins/Runtime/GoogleCloudMessaging/Source/GoogleCloudMessaging/GoogleCloudMessaging_UPL.xml
 UATHelper: Packaging (Android (ASTC)): UnrealBuildTool: 
 UATHelper: Packaging (Android (ASTC)): UnrealBuildTool: UPL: ..\Plugins/Runtime/GoogleVR/GoogleVRHMD/Source/GoogleVRHMD/GoogleVRHMD_APL.xml
 UATHelper: Packaging (Android (ASTC)): UnrealBuildTool: 
 UATHelper: Packaging (Android (ASTC)): UnrealBuildTool: UPL: ..\Source/Runtime/Online/Voice/AndroidVoiceImpl_UPL.xml
 UATHelper: Packaging (Android (ASTC)): UnrealBuildTool: 
 UATHelper: Packaging (Android (ASTC)): UnrealBuildTool: ====16.07.2017 0:46:24====PREPARING TO MAKE APK=================================================================
 UATHelper: Packaging (Android (ASTC)): UnrealBuildTool: Building Java with SDK API level 'android-24'
 UATHelper: Packaging (Android (ASTC)): UnrealBuildTool: 
 UATHelper: Packaging (Android (ASTC)): UnrealBuildTool: Patching ant.bat to work around commandline length limit (using unused drive letter Z:)
 UATHelper: Packaging (Android (ASTC)): UnrealBuildTool: Using package name: 'com.YourCompany.test2'
 UATHelper: Packaging (Android (ASTC)): UnrealBuildTool: 
 UATHelper: Packaging (Android (ASTC)): UnrealBuildTool: ==== Writing to shim file D:\UnrealProjects\test2\test2\Build\Android\src\com\epicgames\ue4\DownloadShim.java ====
 UATHelper: Packaging (Android (ASTC)): UnrealBuildTool: 
 UATHelper: Packaging (Android (ASTC)): UnrealBuildTool: ==== Shim data file up to date so not writing. ====
 UATHelper: Packaging (Android (ASTC)): UnrealBuildTool: 
 UATHelper: Packaging (Android (ASTC)): UnrealBuildTool: ==== Writing to template target file D:\UnrealProjects\test2\test2\Build\Android\src\com\YourCompany\test2\AlarmReceiver.java ====
 UATHelper: Packaging (Android (ASTC)): UnrealBuildTool: 
 UATHelper: Packaging (Android (ASTC)): UnrealBuildTool: ==== Template target file up to date so not writing. ====
 UATHelper: Packaging (Android (ASTC)): UnrealBuildTool: 
 UATHelper: Packaging (Android (ASTC)): UnrealBuildTool: ==== Writing to template target file D:\UnrealProjects\test2\test2\Build\Android\src\com\YourCompany\test2\DownloaderActivity.java ====
 UATHelper: Packaging (Android (ASTC)): UnrealBuildTool: 
 UATHelper: Packaging (Android (ASTC)): UnrealBuildTool: ==== Template target file up to date so not writing. ====
 UATHelper: Packaging (Android (ASTC)): UnrealBuildTool: 
 UATHelper: Packaging (Android (ASTC)): UnrealBuildTool: ==== Writing to template target file D:\UnrealProjects\test2\test2\Build\Android\src\com\YourCompany\test2\OBBDownloaderService.java ====
 UATHelper: Packaging (Android (ASTC)): UnrealBuildTool: 
 UATHelper: Packaging (Android (ASTC)): UnrealBuildTool: ==== Template target file up to date so not writing. ====
 UATHelper: Packaging (Android (ASTC)): UnrealBuildTool: Cleaning up files based on template dir D:\UnrealProjects\test2\test2\Build\Android\src\com\YourCompany\test2
 UATHelper: Packaging (Android (ASTC)): UnrealBuildTool: D:\UnrealProjects\test2\test2\Binaries\Android\test2-arm64-es2.apk is out of date due to newer input file D:\UnrealProjects\test2\test2\Binaries\Android\test2-arm64-es2.so
 UATHelper: Packaging (Android (ASTC)): UnrealBuildTool: UPL Init: arm64-v8a
 UATHelper: Packaging (Android (ASTC)): UnrealBuildTool: Android Permission Plugin Init
 UATHelper: Packaging (Android (ASTC)): UnrealBuildTool: GearVR init
 UATHelper: Packaging (Android (ASTC)): UnrealBuildTool: Oculus Signature Files (osig) will be removed from APK
 UATHelper: Packaging (Android (ASTC)): UnrealBuildTool: GearVRController init
 UATHelper: Packaging (Android (ASTC)): UnrealBuildTool: Google Cloud Messaging init
 UATHelper: Packaging (Android (ASTC)): UnrealBuildTool: GCMClientSenderID set: false
 UATHelper: Packaging (Android (ASTC)): UnrealBuildTool: GoogleVRHMD init
 UATHelper: Packaging (Android (ASTC)): UnrealBuildTool: Sustained-performance mode is desired
 UATHelper: Packaging (Android (ASTC)): UnrealBuildTool: Project supports daydream, will enable async reprojection when possible.
 UATHelper: Packaging (Android (ASTC)): UnrealBuildTool: Android Voice init
 UATHelper: Packaging (Android (ASTC)): UnrealBuildTool: On build machine.
 UATHelper: Packaging (Android (ASTC)): UnrealBuildTool: Disabling Show Launch Image for Daydream enabled application
 UATHelper: Packaging (Android (ASTC)): UnrealBuildTool: bPackageDataInsideApk = False
 UATHelper: Packaging (Android (ASTC)): UnrealBuildTool: Added repository: C:\NVPACK\android-sdk-windows\extras\android\m2repository
 UATHelper: Packaging (Android (ASTC)): UnrealBuildTool: Added repository: ..\Source\ThirdParty\Android\extras\google\m2repository
 UATHelper: Packaging (Android (ASTC)): UnrealBuildTool: Added repository: ..\Source\ThirdParty\Android\extras\android\m2repository
 UATHelper: Packaging (Android (ASTC)): UnrealBuildTool: AARImports: com.google.android.gms, play-services-ads, 9.2.0
 UATHelper: Packaging (Android (ASTC)): UnrealBuildTool: AARImports: com.google.android.gms, play-services-auth, 9.2.0
 UATHelper: Packaging (Android (ASTC)): UnrealBuildTool: AARImports: com.google.android.gms, play-services-games, 9.2.0
 UATHelper: Packaging (Android (ASTC)): UnrealBuildTool: AARImports: com.google.android.gms, play-services-nearby, 9.2.0
 UATHelper: Packaging (Android (ASTC)): UnrealBuildTool: AARImports: com.google.android.gms, play-services-plus, 9.2.0
 UATHelper: Packaging (Android (ASTC)): UnrealBuildTool: AARImports: com.android.support, support-v13, 25.0.0
 UATHelper: Packaging (Android (ASTC)): UnrealBuildTool: AAR: support-v4: 25.0.0 newer than 23.0.0
 UATHelper: Packaging (Android (ASTC)): UnrealBuildTool: AAR: support-annotations: 25.0.0 newer than 23.0.0
 UATHelper: Packaging (Android (ASTC)): UnrealBuildTool: Extracting AARs
 UATHelper: Packaging (Android (ASTC)): UnrealBuildTool: 
 UATHelper: Packaging (Android (ASTC)): UnrealBuildTool: ====16.07.2017 0:46:24====PREPARING NATIVE CODE=================================================================
 UATHelper: Packaging (Android (ASTC)): UnrealBuildTool: On build machine.
 UATHelper: Packaging (Android (ASTC)): UnrealBuildTool: Disabling Show Launch Image for Daydream enabled application
 UATHelper: Packaging (Android (ASTC)): UnrealBuildTool: Copying permission_library directory to staging before build
 UATHelper: Packaging (Android (ASTC)): UnrealBuildTool: 
 UATHelper: Packaging (Android (ASTC)): UnrealBuildTool: Directory ..\/Source/ThirdParty/AndroidPermission/permission_library copied to D:\UnrealProjects\test2\test2\Intermediate/Android/APK/JavaLibs/permission_library
 UATHelper: Packaging (Android (ASTC)): UnrealBuildTool: Copying GoogleVR buildtime files to staging
 UATHelper: Packaging (Android (ASTC)): UnrealBuildTool: 
 UATHelper: Packaging (Android (ASTC)): UnrealBuildTool: Directory ..\/Source/ThirdParty/GoogleVR/lib/common_library copied to D:\UnrealProjects\test2\test2\Intermediate/Android/APK/JavaLibs/common_library
 UATHelper: Packaging (Android (ASTC)): UnrealBuildTool: 
 UATHelper: Packaging (Android (ASTC)): UnrealBuildTool: ====16.07.2017 0:46:24====UPDATING BUILD CONFIGURATION FILES====================================================
 UATHelper: Packaging (Android (ASTC)): UnrealBuildTool: ���⥬� �� 㤠���� ���� 㪠����� ����.
 UATHelper: Packaging (Android (ASTC)): UnrealBuildTool: Updating project.properties, local.properties, and build.xml for common_library...
 UATHelper: Packaging (Android (ASTC)): UnrealBuildTool: ���⥬� �� 㤠���� ���� 㪠����� ����.
 UATHelper: Packaging (Android (ASTC)): UnrealBuildTool: ���⥬� �� 㤠���� ���� 㪠����� ����.
 UATHelper: Packaging (Android (ASTC)): UnrealBuildTool: Updating project.properties, local.properties, and build.xml for downloader_library...
 UATHelper: Packaging (Android (ASTC)): UnrealBuildTool: ���⥬� �� 㤠���� ���� 㪠����� ����.
 UATHelper: Packaging (Android (ASTC)): UnrealBuildTool: ���⥬� �� 㤠���� ���� 㪠����� ����.
 UATHelper: Packaging (Android (ASTC)): UnrealBuildTool: Updating project.properties, local.properties, and build.xml for permission_library...
 UATHelper: Packaging (Android (ASTC)): UnrealBuildTool: ���⥬� �� 㤠���� ���� 㪠����� ����.
 UATHelper: Packaging (Android (ASTC)): UnrealBuildTool: ���⥬� �� 㤠���� ���� 㪠����� ����.
 UATHelper: Packaging (Android (ASTC)): UnrealBuildTool: Updating project.properties, local.properties, and build.xml for play-services-ads-9.2.0...
 UATHelper: Packaging (Android (ASTC)): UnrealBuildTool: ���⥬� �� 㤠���� ���� 㪠����� ����.
 UATHelper: Packaging (Android (ASTC)): UnrealBuildTool: ���⥬� �� 㤠���� ���� 㪠����� ����.
 UATHelper: Packaging (Android (ASTC)): UnrealBuildTool: Updating project.properties, local.properties, and build.xml for play-services-ads-lite-9.2.0...
 UATHelper: Packaging (Android (ASTC)): UnrealBuildTool: ���⥬� �� 㤠���� ���� 㪠����� ����.
 UATHelper: Packaging (Android (ASTC)): UnrealBuildTool: ���⥬� �� 㤠���� ���� 㪠����� ����.
 UATHelper: Packaging (Android (ASTC)): UnrealBuildTool: Updating project.properties, local.properties, and build.xml for play-services-auth-9.2.0...
 UATHelper: Packaging (Android (ASTC)): UnrealBuildTool: ���⥬� �� 㤠���� ���� 㪠����� ����.
 UATHelper: Packaging (Android (ASTC)): UnrealBuildTool: ���⥬� �� 㤠���� ���� 㪠����� ����.
 UATHelper: Packaging (Android (ASTC)): UnrealBuildTool: Updating project.properties, local.properties, and build.xml for play-services-auth-base-9.2.0...
 UATHelper: Packaging (Android (ASTC)): UnrealBuildTool: ���⥬� �� 㤠���� ���� 㪠����� ����.
 UATHelper: Packaging (Android (ASTC)): UnrealBuildTool: ���⥬� �� 㤠���� ���� 㪠����� ����.
 UATHelper: Packaging (Android (ASTC)): UnrealBuildTool: Updating project.properties, local.properties, and build.xml for play-services-base-9.2.0...
 UATHelper: Packaging (Android (ASTC)): UnrealBuildTool: ���⥬� �� 㤠���� ���� 㪠����� ����.
 UATHelper: Packaging (Android (ASTC)): UnrealBuildTool: ���⥬� �� 㤠���� ���� 㪠����� ����.
 UATHelper: Packaging (Android (ASTC)): UnrealBuildTool: Updating project.properties, local.properties, and build.xml for play-services-basement-9.2.0...
 UATHelper: Packaging (Android (ASTC)): UnrealBuildTool: ���⥬� �� 㤠���� ���� 㪠����� ����.
 UATHelper: Packaging (Android (ASTC)): UnrealBuildTool: ���⥬� �� 㤠���� ���� 㪠����� ����.
 UATHelper: Packaging (Android (ASTC)): UnrealBuildTool: Updating project.properties, local.properties, and build.xml for play-services-clearcut-9.2.0...
 UATHelper: Packaging (Android (ASTC)): UnrealBuildTool: ���⥬� �� 㤠���� ���� 㪠����� ����.
 UATHelper: Packaging (Android (ASTC)): UnrealBuildTool: ���⥬� �� 㤠���� ���� 㪠����� ����.
 UATHelper: Packaging (Android (ASTC)): UnrealBuildTool: Updating project.properties, local.properties, and build.xml for play-services-drive-9.2.0...
 UATHelper: Packaging (Android (ASTC)): UnrealBuildTool: ���⥬� �� 㤠���� ���� 㪠����� ����.
 UATHelper: Packaging (Android (ASTC)): UnrealBuildTool: ���⥬� �� 㤠���� ���� 㪠����� ����.
 UATHelper: Packaging (Android (ASTC)): UnrealBuildTool: Updating project.properties, local.properties, and build.xml for play-services-games-9.2.0...
 UATHelper: Packaging (Android (ASTC)): UnrealBuildTool: ���⥬� �� 㤠���� ���� 㪠����� ����.
 UATHelper: Packaging (Android (ASTC)): UnrealBuildTool: ���⥬� �� 㤠���� ���� 㪠����� ����.
 UATHelper: Packaging (Android (ASTC)): UnrealBuildTool: Updating project.properties, local.properties, and build.xml for play-services-gass-9.2.0...
 UATHelper: Packaging (Android (ASTC)): UnrealBuildTool: ���⥬� �� 㤠���� ���� 㪠����� ����.
 UATHelper: Packaging (Android (ASTC)): UnrealBuildTool: ���⥬� �� 㤠���� ���� 㪠����� ����.
 UATHelper: Packaging (Android (ASTC)): UnrealBuildTool: Updating project.properties, local.properties, and build.xml for play-services-nearby-9.2.0...
 UATHelper: Packaging (Android (ASTC)): UnrealBuildTool: ���⥬� �� 㤠���� ���� 㪠����� ����.
 UATHelper: Packaging (Android (ASTC)): UnrealBuildTool: ���⥬� �� 㤠���� ���� 㪠����� ����.
 UATHelper: Packaging (Android (ASTC)): UnrealBuildTool: Updating project.properties, local.properties, and build.xml for play-services-plus-9.2.0...
 UATHelper: Packaging (Android (ASTC)): UnrealBuildTool: ���⥬� �� 㤠���� ���� 㪠����� ����.
 UATHelper: Packaging (Android (ASTC)): UnrealBuildTool: ���⥬� �� 㤠���� ���� 㪠����� ����.
 UATHelper: Packaging (Android (ASTC)): UnrealBuildTool: Updating project.properties, local.properties, and build.xml for play-services-tasks-9.2.0...
 UATHelper: Packaging (Android (ASTC)): UnrealBuildTool: ���⥬� �� 㤠���� ���� 㪠����� ����.
 UATHelper: Packaging (Android (ASTC)): UnrealBuildTool: ���⥬� �� 㤠���� ���� 㪠����� ����.
 UATHelper: Packaging (Android (ASTC)): UnrealBuildTool: Updating project.properties, local.properties, and build.xml for support-compat-25.0.0...
 UATHelper: Packaging (Android (ASTC)): UnrealBuildTool: ���⥬� �� 㤠���� ���� 㪠����� ����.
 UATHelper: Packaging (Android (ASTC)): UnrealBuildTool: ���⥬� �� 㤠���� ���� 㪠����� ����.
 UATHelper: Packaging (Android (ASTC)): UnrealBuildTool: Updating project.properties, local.properties, and build.xml for support-core-ui-25.0.0...
 UATHelper: Packaging (Android (ASTC)): UnrealBuildTool: ���⥬� �� 㤠���� ���� 㪠����� ����.
 UATHelper: Packaging (Android (ASTC)): UnrealBuildTool: ���⥬� �� 㤠���� ���� 㪠����� ����.
 UATHelper: Packaging (Android (ASTC)): UnrealBuildTool: Updating project.properties, local.properties, and build.xml for support-core-utils-25.0.0...
 UATHelper: Packaging (Android (ASTC)): UnrealBuildTool: ���⥬� �� 㤠���� ���� 㪠����� ����.
 UATHelper: Packaging (Android (ASTC)): UnrealBuildTool: ���⥬� �� 㤠���� ���� 㪠����� ����.
 UATHelper: Packaging (Android (ASTC)): UnrealBuildTool: Updating project.properties, local.properties, and build.xml for support-fragment-25.0.0...
 UATHelper: Packaging (Android (ASTC)): UnrealBuildTool: ���⥬� �� 㤠���� ���� 㪠����� ����.
 UATHelper: Packaging (Android (ASTC)): UnrealBuildTool: ���⥬� �� 㤠���� ���� 㪠����� ����.
 UATHelper: Packaging (Android (ASTC)): UnrealBuildTool: Updating project.properties, local.properties, and build.xml for support-media-compat-25.0.0...
 UATHelper: Packaging (Android (ASTC)): UnrealBuildTool: ���⥬� �� 㤠���� ���� 㪠����� ����.
 UATHelper: Packaging (Android (ASTC)): UnrealBuildTool: ���⥬� �� 㤠���� ���� 㪠����� ����.
 UATHelper: Packaging (Android (ASTC)): UnrealBuildTool: Updating project.properties, local.properties, and build.xml for support-v13-25.0.0...
 UATHelper: Packaging (Android (ASTC)): UnrealBuildTool: ���⥬� �� 㤠���� ���� 㪠����� ����.
 UATHelper: Packaging (Android (ASTC)): UnrealBuildTool: ���⥬� �� 㤠���� ���� 㪠����� ����.
 UATHelper: Packaging (Android (ASTC)): UnrealBuildTool: Updating project.properties, local.properties, and build.xml for support-v4-25.0.0...
 UATHelper: Packaging (Android (ASTC)): UnrealBuildTool: ���⥬� �� 㤠���� ���� 㪠����� ����.
 UATHelper: Packaging (Android (ASTC)): UnrealBuildTool: 
 UATHelper: Packaging (Android (ASTC)): UnrealBuildTool: ==== Writing new GameActivity.java file to D:\UnrealProjects\test2\test2\Intermediate/Android/APK\src\com\epicgames\ue4\GameActivity.java ====
 UATHelper: Packaging (Android (ASTC)): UnrealBuildTool: Preparing native code for debugging...
 UATHelper: Packaging (Android (ASTC)): UnrealBuildTool: ERROR: C:/NVPACK/android-ndk-r12b/ndk-build.cmd failed with args APP_ABI="arm64-v8a " NDK_DEBUG=1
 UATHelper: Packaging (Android (ASTC)): UnrealBuildTool: Total build time: 37,10 seconds (NoActionsToExecute executor: 0,00 seconds)
 UATHelper: Packaging (Android (ASTC)): CommandUtils.Run: Run: Took 37,2905154s to run UnrealBuildTool.exe, ExitCode=5
 UATHelper: Packaging (Android (ASTC)): Program.Main: ERROR: AutomationTool terminated with exception: AutomationTool.CommandUtils+CommandFailedException: Command failed (Result:5): D:\Program Files\Epic Games\UE_4.16\Engine\Binaries\DotNET\UnrealBuildTool.exe test2 Android Development -Project=D:\UnrealProjects\test2\test2\test2.uproject  D:\UnrealProjects\t
 est2\test2\test2.uproject -NoUBTMakefiles  -remoteini="D:\UnrealProjects\test2\test2" -noxge -NoHotReload -ignorejunk. See logfile for details: 'UnrealBuildTool-2017.07.16-00.46.21.txt' 
 UATHelper: Packaging (Android (ASTC)):    в AutomationTool.CommandUtils.RunAndLog(String App, String CommandLine, String Logfile, Int32 MaxSuccessCode, String Input, ERunOptions Options, Dictionary`2 EnvVars, SpewFilterCallbackType SpewFilterCallback)
 UATHelper: Packaging (Android (ASTC)):    в AutomationTool.CommandUtils.RunAndLog(CommandEnvironment Env, String App, String CommandLine, String LogName, Int32 MaxSuccessCode, String Input, ERunOptions Options, Dictionary`2 EnvVars, SpewFilterCallbackType SpewFilterCallback)
 UATHelper: Packaging (Android (ASTC)):    в AutomationTool.CommandUtils.RunUBT(CommandEnvironment Env, String UBTExecutable, String CommandLine, String LogName, Dictionary`2 EnvVars)
 UATHelper: Packaging (Android (ASTC)):    в AutomationTool.CommandUtils.RunUBT(CommandEnvironment Env, String UBTExecutable, FileReference Project, String Target, String Platform, String Config, String AdditionalArgs, String LogName, Dictionary`2 EnvVars)
 UATHelper: Packaging (Android (ASTC)):    в AutomationTool.UE4Build.BuildWithUBT(String TargetName, UnrealTargetPlatform TargetPlatform, String Config, FileReference UprojectPath, Boolean ForceMonolithic, Boolean ForceNonUnity, Boolean ForceDebugInfo, Boolean ForceFlushMac, Boolean DisableXGE, String InAddArgs, Boolean ForceUnity, Dictionary`2 EnvVars)
 UATHelper: Packaging (Android (ASTC)):    в AutomationTool.UE4Build.Build(BuildAgenda Agenda, Nullable`1 InDeleteBuildProducts, Boolean InUpdateVersionFiles, Boolean InForceNoXGE, Boolean InUseParallelExecutor, Boolean InForceNonUnity, Boolean InForceUnity, Boolean InShowProgress, Dictionary`2 PlatformEnvVars, Nullable`1 InChangelistNumberOverride, Dictionar
 y`2 InTargetToManifest)
 UATHelper: Packaging (Android (ASTC)):    в Project.Build(BuildCommand Command, ProjectParams Params, Int32 WorkingCL, ProjectBuildTargets TargetMask)
 UATHelper: Packaging (Android (ASTC)):    в BuildCookRun.DoBuildCookRun(ProjectParams Params)
 UATHelper: Packaging (Android (ASTC)):    в BuildCookRun.ExecuteBuild()
 UATHelper: Packaging (Android (ASTC)):    в AutomationTool.BuildCommand.Execute()
 UATHelper: Packaging (Android (ASTC)):    в AutomationTool.Automation.Execute(List`1 CommandsToExecute, CaselessDictionary`1 Commands)
 UATHelper: Packaging (Android (ASTC)):    в AutomationTool.Automation.Process(String[] Arguments)
 UATHelper: Packaging (Android (ASTC)):    в AutomationTool.Program.MainProc(Object Param)
 UATHelper: Packaging (Android (ASTC)):    в AutomationTool.InternalUtils.RunSingleInstance(Func`2 Main, Object Param)
 UATHelper: Packaging (Android (ASTC)):    в AutomationTool.Program.Main()
 UATHelper: Packaging (Android (ASTC)): Program.Main: AutomationTool exiting with ExitCode=5 (5)
 UATHelper: Packaging (Android (ASTC)): BUILD FAILED
 PackagingResults:Error: Error Unknown Error

Please help! I've tried everything I've found googling, such as install CodeWorks to drive C, running editor with administrative privileges, and nothing helped

Product Version: UE 4.16
Tags:
more ▼

asked Jul 15 '17 at 09:54 PM in VR

avatar image

m.a.kutuzov
17 3 3 7

(comments are locked)
10|2000 characters needed characters left
Viewable by all users

4 answers: sort voted first

Hey actually i think your problem is something that I have run into as well.

I think the Panda user doesn't have the right security permissions. Maybe because as you say the user doesn't exist properly. You can see it ends right as it tries to run the .bat file it creates at the very end. Perhaps this was the user that NVPACK was installed under?

Anyway you may be able to get around this by temporarily reassigning the temp directory. It tries to put it in the tmp directory for Panda at the end.

make.exe uses the environment variable TMP to decide where to store its temp files so we want to change it temporaily.

Go to c:\NVPACK\android-ndk-r12b\build\ Edit ndk-build.cmd and insert:

 set TMP=c:\UnrealProjects\Temp

So that when the script is run the Environment variable for TMP is set to a different folder. (But replace that path i put with some folder you know you can access)

This is what I had to do at my workplace as they have super strict security policies and can only execute content in certain folders.

So my ndk-build.cmd looks like this

 @echo off
 set NDK_ROOT=%~dp0\..
 set PREBUILT_PATH=%NDK_ROOT%\prebuilt\windows-x86_64
 
 set TMP=c:\UnrealProjects\Temp
 
 if exist %PREBUILT_PATH% goto FOUND
 set PREBUILT_PATH=%NDK_ROOT%\prebuilt\windows
 :FOUND
 "%PREBUILT_PATH%\bin\make.exe" -f "%NDK_ROOT%\build\core\build-local.mk " SHELL=cmd %*
 

The only other solution would be to maybe uninstall nvpack and reinstall and make sure it's installed for all users perhaps? It sounds like the user problem has messed nvpack up a bit but the TMP fix may help

more ▼

answered Jul 17 '17 at 08:28 PM

avatar image

gelliott
273 7 8 17

avatar image m.a.kutuzov Jul 17 '17 at 09:32 PM

It worked! Problem solved! THANK YOU SO MUCH!!! Made a new path for temp (set TMP=c:\UnrealProjects\Temp) and it worked!

avatar image gelliott Jul 17 '17 at 10:54 PM

Awesome that's great news. Have fun developing! :)

(comments are locked)
10|2000 characters needed characters left
Viewable by all users

Do you still get an error when you just click the "Launch" button and select your phone?

The Unreal docs make you go through the packaging process which isnt really necessary if you just want to get up and running with some test stuff.

For figuring out the ndk-build thing... i'll repost what i wrote in another thread about figuring out the causes of that:

Go to the ndk folder in the command line c:\NVPACK\androind-ndk-r12b

Run ndk-build and specify a couple of things. Firstly the APP_ABI and NDK_DEBUG values which will be the same as the ones in your output log. You need to set the NDK_PROJECT_PATH which you should find in the Intermediate folder in your project

But important here is also NDK_LOG = 1 which will give you more info from the NDK makefiles.

So for you it would be:

 ndk-build APP_ABI="arm64-v8a" NDK_DEBUG=1 NDK_PROJECT_PATH="D:/UnrealProjects/test2/test2/Intermediate/Android/APK" NDK_LOG=1
  

If that doesn't show you anything interesting you can also add -d at the end which will give you debug output from make.exe itself

so...

 ndk-build APP_ABI="arm64-v8a" NDK_DEBUG=1 NDK_PROJECT_PATH="D:/UnrealProjects/test2/test2/Intermediate/Android/APK" NDK_LOG=1 -d

That should tell you everything it's trying to do.

But really just try clicking the launch button first and worry about the packaging stuff later.

more ▼

answered Jul 17 '17 at 05:30 PM

avatar image

gelliott
273 7 8 17

avatar image m.a.kutuzov Jul 17 '17 at 06:25 PM

I've tried to comment, but the post is too big so I posted it as an answer

avatar image BenLua Oct 09 '17 at 03:32 AM

I don't know where to set these things up. Can you elaborate on that?

avatar image BenLua Oct 09 '17 at 03:40 AM

set thing at c:\NVPACK\androind-ndk-r12b\ndk-build.cmd?

(comments are locked)
10|2000 characters needed characters left
Viewable by all users

Hello! Thank you very much for advice) But still, I don't get whats happening there(

When I'm trying to launch I get this

 LogPlayLevel: UnrealBuildTool: ==== Writing new GameActivity.java file to D:\UnrealProjects\test2\test2\Intermediate/Android/APK\src\com\epicgames\ue4\GameActivity.java ====
 LogPlayLevel: UnrealBuildTool: Preparing native code for debugging...
 LogPlayLevel: UnrealBuildTool: ERROR: C:/NVPACK/android-ndk-r12b/ndk-build.cmd failed with args APP_ABI="arm64-v8a " NDK_DEBUG=1
 LogPlayLevel: UnrealBuildTool: Total build time: 53,41 seconds (NoActionsToExecute executor: 0,00 seconds)
 LogPlayLevel: CommandUtils.Run: Run: Took 53,6082878s to run UnrealBuildTool.exe, ExitCode=5
 LogPlayLevel: Program.Main: ERROR: AutomationTool terminated with exception: AutomationTool.CommandUtils+CommandFailedException: Command failed (Result:5): D:\Program Files\Epic Games\UE_4.16\Engine\Binaries\DotNET\UnrealBuildTool.exe test2 Android Development -Project=D:\UnrealProjects\test2\test2\test2.uproject  D:\UnrealProjects\test2\test2\test2.uproject
  -NoUBTMakefiles  -remoteini="D:\UnrealProjects\test2\test2" -noxge -NoHotReload -ignorejunk. See logfile for details: 'UnrealBuildTool-2017.07.17-20.52.12.txt'
 LogPlayLevel:    в AutomationTool.CommandUtils.RunAndLog(String App, String CommandLine, String Logfile, Int32 MaxSuccessCode, String Input, ERunOptions Options, Dictionary`2 EnvVars, SpewFilterCallbackType SpewFilterCallback)
 LogPlayLevel:    в AutomationTool.CommandUtils.RunAndLog(CommandEnvironment Env, String App, String CommandLine, String LogName, Int32 MaxSuccessCode, String Input, ERunOptions Options, Dictionary`2 EnvVars, SpewFilterCallbackType SpewFilterCallback)
 LogPlayLevel:    в AutomationTool.CommandUtils.RunUBT(CommandEnvironment Env, String UBTExecutable, String CommandLine, String LogName, Dictionary`2 EnvVars)
 LogPlayLevel:    в AutomationTool.CommandUtils.RunUBT(CommandEnvironment Env, String UBTExecutable, FileReference Project, String Target, String Platform, String Config, String AdditionalArgs, String LogName, Dictionary`2 EnvVars)
 LogPlayLevel:    в AutomationTool.UE4Build.BuildWithUBT(String TargetName, UnrealTargetPlatform TargetPlatform, String Config, FileReference UprojectPath, Boolean ForceMonolithic, Boolean ForceNonUnity, Boolean ForceDebugInfo, Boolean ForceFlushMac, Boolean DisableXGE, String InAddArgs, Boolean ForceUnity, Dictionary`2 EnvVars)
 LogPlayLevel:    в AutomationTool.UE4Build.Build(BuildAgenda Agenda, Nullable`1 InDeleteBuildProducts, Boolean InUpdateVersionFiles, Boolean InForceNoXGE, Boolean InUseParallelExecutor, Boolean InForceNonUnity, Boolean InForceUnity, Boolean InShowProgress, Dictionary`2 PlatformEnvVars, Nullable`1 InChangelistNumberOverride, Dictionary`2 InTargetToManifest)
 LogPlayLevel:    в Project.Build(BuildCommand Command, ProjectParams Params, Int32 WorkingCL, ProjectBuildTargets TargetMask)
 LogPlayLevel:    в BuildCookRun.DoBuildCookRun(ProjectParams Params)
 LogPlayLevel:    в BuildCookRun.ExecuteBuild()
 LogPlayLevel:    в AutomationTool.BuildCommand.Execute()
 LogPlayLevel:    в AutomationTool.Automation.Execute(List`1 CommandsToExecute, CaselessDictionary`1 Commands)
 LogPlayLevel:    в AutomationTool.Automation.Process(String[] Arguments)
 LogPlayLevel:    в AutomationTool.Program.MainProc(Object Param)
 LogPlayLevel:    в AutomationTool.InternalUtils.RunSingleInstance(Func`2 Main, Object Param)
 LogPlayLevel:    в AutomationTool.Program.Main()
 LogPlayLevel: Program.Main: AutomationTool exiting with ExitCode=5 (5)
 LogPlayLevel: Completed Launch On Stage: Build Task, Time: 54.799126
 LogPlayLevel: BUILD FAILED
 PackagingResults:Error: Error Launch failed! Unknown Error

Now about NDK-build

 C:\NVPACK\android-ndk-r12b>ndk-build APP_ABI="arm64-v8a" NDK_DEBUG=1 NDK_PROJECT_PATH="D:/UnrealProjects/test2/test2/Intermediate/Android/APK" NDK_LOG=1
 Android NDK: NDK installation path auto-detected: 'C:/NVPACK/android-ndk-r12b/build//..'
 Android NDK: GNU Make version 3.81 detected
 Android NDK: Host OS was auto-detected: windows
 Android NDK:  Host operating system detected: windows
 "C:\Users\PANDA" не является внутренней или внешней
 командой, исполняемой программой или пакетным файлом.
 Системе не удается найти указанный путь.
 Android NDK: Host CPU was auto-detected: x86
 Android NDK: HOST_TAG set to windows
 Android NDK: Host tools prebuilt directory: C:/NVPACK/android-ndk-r12b/build//../prebuilt/windows-x86_64/bin
 Android NDK: Host 'echo' tool: C:/NVPACK/android-ndk-r12b/build//../prebuilt/windows-x86_64/bin/echo.exe
 Android NDK: Host 'echo -n' tool: C:/NVPACK/android-ndk-r12b/build//../prebuilt/windows-x86_64/bin/echo.exe -n
 Android NDK: Host 'cmp' tool: C:/NVPACK/android-ndk-r12b/build//../prebuilt/windows-x86_64/bin/cmp.exe
 Android NDK: Host 'awk' tool: C:/NVPACK/android-ndk-r12b/build//../prebuilt/windows-x86_64/bin/awk.exe
 Android NDK: Host 'awk' test returned: Pass
 Android NDK: Found platform root directory: C:/NVPACK/android-ndk-r12b/build//../platforms
 Android NDK: Found supported platforms: android-12 android-13 android-14 android-15 android-16 android-17 android-18 android-19 android-21 android-22 android-23 android-24 android-9
 Android NDK: PLATFORM android-12 supports: arm mips x86
 Android NDK:   ABI arm sysroot is: C:/NVPACK/android-ndk-r12b/build//../platforms/android-12/arch-arm
 Android NDK:   ABI mips sysroot is: C:/NVPACK/android-ndk-r12b/build//../platforms/android-12/arch-mips
 Android NDK:   ABI x86 sysroot is: C:/NVPACK/android-ndk-r12b/build//../platforms/android-12/arch-x86
 Android NDK: PLATFORM android-13 supports: arm mips x86
 Android NDK:   ABI arm sysroot is: C:/NVPACK/android-ndk-r12b/build//../platforms/android-13/arch-arm
 Android NDK:   ABI mips sysroot is: C:/NVPACK/android-ndk-r12b/build//../platforms/android-13/arch-mips
 Android NDK:   ABI x86 sysroot is: C:/NVPACK/android-ndk-r12b/build//../platforms/android-13/arch-x86
 Android NDK: PLATFORM android-14 supports: arm mips x86
 Android NDK:   ABI arm sysroot is: C:/NVPACK/android-ndk-r12b/build//../platforms/android-14/arch-arm
 Android NDK:   ABI mips sysroot is: C:/NVPACK/android-ndk-r12b/build//../platforms/android-14/arch-mips
 Android NDK:   ABI x86 sysroot is: C:/NVPACK/android-ndk-r12b/build//../platforms/android-14/arch-x86
 Android NDK: PLATFORM android-15 supports: arm mips x86
 Android NDK:   ABI arm sysroot is: C:/NVPACK/android-ndk-r12b/build//../platforms/android-15/arch-arm
 Android NDK:   ABI mips sysroot is: C:/NVPACK/android-ndk-r12b/build//../platforms/android-15/arch-mips
 Android NDK:   ABI x86 sysroot is: C:/NVPACK/android-ndk-r12b/build//../platforms/android-15/arch-x86
 Android NDK: PLATFORM android-16 supports: arm mips x86
 Android NDK:   ABI arm sysroot is: C:/NVPACK/android-ndk-r12b/build//../platforms/android-16/arch-arm
 Android NDK:   ABI mips sysroot is: C:/NVPACK/android-ndk-r12b/build//../platforms/android-16/arch-mips
 Android NDK:   ABI x86 sysroot is: C:/NVPACK/android-ndk-r12b/build//../platforms/android-16/arch-x86
 Android NDK: PLATFORM android-17 supports: arm mips x86
 Android NDK:   ABI arm sysroot is: C:/NVPACK/android-ndk-r12b/build//../platforms/android-17/arch-arm
 Android NDK:   ABI mips sysroot is: C:/NVPACK/android-ndk-r12b/build//../platforms/android-17/arch-mips
 Android NDK:   ABI x86 sysroot is: C:/NVPACK/android-ndk-r12b/build//../platforms/android-17/arch-x86
 Android NDK: PLATFORM android-18 supports: arm mips x86
 Android NDK:   ABI arm sysroot is: C:/NVPACK/android-ndk-r12b/build//../platforms/android-18/arch-arm
 Android NDK:   ABI mips sysroot is: C:/NVPACK/android-ndk-r12b/build//../platforms/android-18/arch-mips
 Android NDK:   ABI x86 sysroot is: C:/NVPACK/android-ndk-r12b/build//../platforms/android-18/arch-x86
 Android NDK: PLATFORM android-19 supports: arm mips x86
 Android NDK:   ABI arm sysroot is: C:/NVPACK/android-ndk-r12b/build//../platforms/android-19/arch-arm
 Android NDK:   ABI mips sysroot is: C:/NVPACK/android-ndk-r12b/build//../platforms/android-19/arch-mips
 Android NDK:   ABI x86 sysroot is: C:/NVPACK/android-ndk-r12b/build//../platforms/android-19/arch-x86
 Android NDK: PLATFORM android-21 supports: arm arm64 mips mips64 x86 x86_64
 Android NDK:   ABI arm sysroot is: C:/NVPACK/android-ndk-r12b/build//../platforms/android-21/arch-arm
 Android NDK:   ABI arm64 sysroot is: C:/NVPACK/android-ndk-r12b/build//../platforms/android-21/arch-arm64
 Android NDK:   ABI mips sysroot is: C:/NVPACK/android-ndk-r12b/build//../platforms/android-21/arch-mips
 Android NDK:   ABI mips64 sysroot is: C:/NVPACK/android-ndk-r12b/build//../platforms/android-21/arch-mips64
 Android NDK:   ABI x86 sysroot is: C:/NVPACK/android-ndk-r12b/build//../platforms/android-21/arch-x86
 Android NDK:   ABI x86_64 sysroot is: C:/NVPACK/android-ndk-r12b/build//../platforms/android-21/arch-x86_64
 Android NDK: PLATFORM android-22 supports: arm arm64 mips mips64 x86 x86_64
 Android NDK:   ABI arm sysroot is: C:/NVPACK/android-ndk-r12b/build//../platforms/android-22/arch-arm
 Android NDK:   ABI arm64 sysroot is: C:/NVPACK/android-ndk-r12b/build//../platforms/android-22/arch-arm64
 Android NDK:   ABI mips sysroot is: C:/NVPACK/android-ndk-r12b/build//../platforms/android-22/arch-mips
 Android NDK:   ABI mips64 sysroot is: C:/NVPACK/android-ndk-r12b/build//../platforms/android-22/arch-mips64
 Android NDK:   ABI x86 sysroot is: C:/NVPACK/android-ndk-r12b/build//../platforms/android-22/arch-x86
 Android NDK:   ABI x86_64 sysroot is: C:/NVPACK/android-ndk-r12b/build//../platforms/android-22/arch-x86_64
 Android NDK: PLATFORM android-23 supports: arm arm64 mips mips64 x86 x86_64
 Android NDK:   ABI arm sysroot is: C:/NVPACK/android-ndk-r12b/build//../platforms/android-23/arch-arm
 Android NDK:   ABI arm64 sysroot is: C:/NVPACK/android-ndk-r12b/build//../platforms/android-23/arch-arm64
 Android NDK:   ABI mips sysroot is: C:/NVPACK/android-ndk-r12b/build//../platforms/android-23/arch-mips
 Android NDK:   ABI mips64 sysroot is: C:/NVPACK/android-ndk-r12b/build//../platforms/android-23/arch-mips64
 Android NDK:   ABI x86 sysroot is: C:/NVPACK/android-ndk-r12b/build//../platforms/android-23/arch-x86
 Android NDK:   ABI x86_64 sysroot is: C:/NVPACK/android-ndk-r12b/build//../platforms/android-23/arch-x86_64
 Android NDK: PLATFORM android-24 supports: arm arm64 mips mips64 x86 x86_64
 Android NDK:   ABI arm sysroot is: C:/NVPACK/android-ndk-r12b/build//../platforms/android-24/arch-arm
 Android NDK:   ABI arm64 sysroot is: C:/NVPACK/android-ndk-r12b/build//../platforms/android-24/arch-arm64
 Android NDK:   ABI mips sysroot is: C:/NVPACK/android-ndk-r12b/build//../platforms/android-24/arch-mips
 Android NDK:   ABI mips64 sysroot is: C:/NVPACK/android-ndk-r12b/build//../platforms/android-24/arch-mips64
 Android NDK:   ABI x86 sysroot is: C:/NVPACK/android-ndk-r12b/build//../platforms/android-24/arch-x86
 Android NDK:   ABI x86_64 sysroot is: C:/NVPACK/android-ndk-r12b/build//../platforms/android-24/arch-x86_64
 Android NDK: PLATFORM android-9 supports: arm mips x86
 Android NDK:   ABI arm sysroot is: C:/NVPACK/android-ndk-r12b/build//../platforms/android-9/arch-arm
 Android NDK:   ABI mips sysroot is: C:/NVPACK/android-ndk-r12b/build//../platforms/android-9/arch-mips
 Android NDK:   ABI x86 sysroot is: C:/NVPACK/android-ndk-r12b/build//../platforms/android-9/arch-x86
 Android NDK: Found stable platform levels: 12 13 14 15 16 17 18 19 21 22 23 24 9
 Android NDK: Found max platform level: 24
 Android NDK:  This NDK supports the following target architectures and ABIS:
 Android NDK:    arm: armeabi armeabi-v7a
 Android NDK:    arm64: arm64-v8a
 Android NDK:    mips: mips
 Android NDK:    mips64: mips64
 Android NDK:    x86: x86
 Android NDK:    x86_64: x86_64
 Android NDK:  This NDK supports the following toolchains and target ABIs:
 Android NDK:    aarch64-linux-android-4.9:  arm64-v8a
 Android NDK:    aarch64-linux-android-clang:  arm64-v8a
 Android NDK:    arm-linux-androideabi-4.9:  armeabi armeabi-v7a
 Android NDK:    arm-linux-androideabi-clang:  armeabi armeabi-v7a
 Android NDK:    mips64el-linux-android-4.9:  mips64
 Android NDK:    mips64el-linux-android-clang:  mips64
 Android NDK:    mipsel-linux-android-4.9:  mips
 Android NDK:    mipsel-linux-android-clang:  mips
 Android NDK:    x86-4.9:  x86
 Android NDK:    x86-clang:  x86
 Android NDK:    x86_64-4.9:  x86_64
 Android NDK:    x86_64-clang:  x86_64
 Android NDK: Found project path: D:/UnrealProjects/test2/test2/Intermediate/Android/APK
 Android NDK: Ouput path for intermediate files: D:/UnrealProjects/test2/test2/Intermediate/Android/APK/obj
 Android NDK: Ouput path for generated library files: D:/UnrealProjects/test2/test2/Intermediate/Android/APK/libs
 Android NDK: Parsing D:/UnrealProjects/test2/test2/Intermediate/Android/APK/jni/Application.mk
 Android NDK:   APP_PIE is
 Android NDK:   Defaulted to APP_BUILD_SCRIPT=D:/UnrealProjects/test2/test2/Intermediate/Android/APK/jni/Android.mk
 Android NDK: Application 'local' forced debuggable through NDK_DEBUG
 Android NDK: Selecting debug optimization mode (app is debuggable)
 Android NDK: Adding import directory: C:/NVPACK/android-ndk-r12b/build//../sources
 Android NDK: Building application 'local' for ABI 'arm64-v8a'
 Android NDK:   Enabling -fPIE for TARGET_PLATFORM android-21
 Android NDK: Using target toolchain 'aarch64-linux-android-4.9' for 'arm64-v8a' ABI
 Android NDK: Looking for imported module with tag 'cxx-stl/system'
 Android NDK:   Probing C:/NVPACK/android-ndk-r12b/build//../sources/cxx-stl/system/Android.mk
 Android NDK:     Found in C:/NVPACK/android-ndk-r12b/build//../sources/cxx-stl/system
 Android NDK: [arm64-v8a] Modules to build: UE4
 "C:\Users\PANDA" не является внутренней или внешней
 командой, исполняемой программой или пакетным файлом.
 Системе не удается найти указанный путь.
 make: *** [D:/UnrealProjects/test2/test2/Intermediate/Android/APK/libs/arm64-v8a] Error 1


"C:\Users\PANDA" не является внутренней или внешней командой, исполняемой программой или пакетным файлом. Системе не удается найти указанный путь. - system can't find this path. I don't get why it's even here. There were two users in my Windows 10 system 1.PANDA 2. Panda&Kit, then I deleted one (the second of them named PANDA, I deleted it from windows, and deleted the folder in C\Users. Now this folder mystically returned)) there is lib folder in it and nothing else.alt text If I delete the folder, it would be created again. I think when I'm trying to build an Android package, some files go there. I don't know where to change this path, and the logic of whats happening here. Please help me understand and fix this situation.

folder.png (63.3 kB)
more ▼

answered Jul 17 '17 at 06:23 PM

avatar image

m.a.kutuzov
17 3 3 7

avatar image gelliott Jul 17 '17 at 06:57 PM

run it again with the -d at the end to get the debug output from make.exe as it looks like it is failing in that.

avatar image m.a.kutuzov Jul 17 '17 at 07:02 PM

I did it, but don't get whats wrong, log below

(comments are locked)
10|2000 characters needed characters left
Viewable by all users
 C:\NVPACK\android-ndk-r12b>ndk-build APP_ABI="arm64-v8a" NDK_DEBUG=1 NDK_PROJECT_PATH="D:/UnrealProjects/test2/test2/Intermediate/Android/APK" NDK_LOG=1 -d
 GNU Make 3.81
 Copyright (C) 2006  Free Software Foundation, Inc.
 This is free software; see the source for copying conditions.
 There is NO warranty; not even for MERCHANTABILITY or FITNESS FOR A
 PARTICULAR PURPOSE.
 
 This program built for i586-pc-mingw32
 find_and_set_shell setting default_shell = cmd
 Reading makefiles...
 Reading makefile `C:\NVPACK\android-ndk-r12b\build\\..\build\core\build-local.mk'...
 Android NDK: NDK installation path auto-detected: 'C:/NVPACK/android-ndk-r12b/build//..'
 Reading makefile `C:/NVPACK/android-ndk-r12b/build//../build/core/init.mk' (search path) (no ~ expansion)...
 Android NDK: GNU Make version 3.81 detected
 Android NDK: Host OS was auto-detected: windows
 Android NDK:  Host operating system detected: windows
 Creating temporary batch file C:\Users\PANDA&~1\AppData\Local\Temp\make7128-1.bat
 CreateProcess(C:\Users\PANDA&~1\AppData\Local\Temp\make7128-1.bat,C:\Users\PANDA&~1\AppData\Local\Temp\make7128-1.bat,...)
 "C:\Users\PANDA" не является внутренней или внешней
 командой, исполняемой программой или пакетным файлом.
 Системе не удается найти указанный путь.
 Main thread handle = 00000000000000C0
 Cleaning up temporary batch file C:\Users\PANDA&~1\AppData\Local\Temp\make7128-1.bat
 Android NDK: Host CPU was auto-detected: x86
 Android NDK: HOST_TAG set to windows
 Android NDK: Host tools prebuilt directory: C:/NVPACK/android-ndk-r12b/build//../prebuilt/windows-x86_64/bin
 Android NDK: Host 'echo' tool: C:/NVPACK/android-ndk-r12b/build//../prebuilt/windows-x86_64/bin/echo.exe
 Android NDK: Host 'echo -n' tool: C:/NVPACK/android-ndk-r12b/build//../prebuilt/windows-x86_64/bin/echo.exe -n
 Android NDK: Host 'cmp' tool: C:/NVPACK/android-ndk-r12b/build//../prebuilt/windows-x86_64/bin/cmp.exe
 Android NDK: Host 'awk' tool: C:/NVPACK/android-ndk-r12b/build//../prebuilt/windows-x86_64/bin/awk.exe
 CreateProcess(C:\NVPACK\android-ndk-r12b\prebuilt\windows-x86_64\bin\awk.exe,C:/NVPACK/android-ndk-r12b/build//../prebuilt/windows-x86_64/bin/awk.exe -f C:/NVPACK/android-ndk-r12b/build//../build/awk/check-awk.awk,...)
 Android NDK: Host 'awk' test returned: Pass
 Reading makefile `C:/NVPACK/android-ndk-r12b/build//../build/core/definitions.mk' (search path) (no ~ expansion)...
 Reading makefile `C:/NVPACK/android-ndk-r12b/build//../build/gmsl/gmsl' (search path) (no ~ expansion)...
 Reading makefile `C:/NVPACK/android-ndk-r12b/build//../build/gmsl/__gmsl' (search path) (no ~ expansion)...
 Reading makefile `C:/NVPACK/android-ndk-r12b/build//../build/core/definitions-tests.mk' (search path) (no ~ expansion)...
 Reading makefile `C:/NVPACK/android-ndk-r12b/build//../build/core/definitions-utils.mk' (search path) (no ~ expansion)...
 Reading makefile `C:/NVPACK/android-ndk-r12b/build//../build/core/definitions-host.mk' (search path) (no ~ expansion)...
 Reading makefile `C:/NVPACK/android-ndk-r12b/build//../build/core/definitions-graph.mk' (search path) (no ~ expansion)...
 Android NDK: Found platform root directory: C:/NVPACK/android-ndk-r12b/build//../platforms
 Android NDK: Found supported platforms: android-12 android-13 android-14 android-15 android-16 android-17 android-18 android-19 android-21 android-22 android-23 android-24 android-9
 Reading makefile `C:/NVPACK/android-ndk-r12b/build//../build/core/add-platform.mk' (search path) (no ~ expansion)...
 Android NDK: PLATFORM android-12 supports: arm mips x86
 Android NDK:   ABI arm sysroot is: C:/NVPACK/android-ndk-r12b/build//../platforms/android-12/arch-arm
 Android NDK:   ABI mips sysroot is: C:/NVPACK/android-ndk-r12b/build//../platforms/android-12/arch-mips
 Android NDK:   ABI x86 sysroot is: C:/NVPACK/android-ndk-r12b/build//../platforms/android-12/arch-x86
 Reading makefile `C:/NVPACK/android-ndk-r12b/build//../build/core/add-platform.mk' (search path) (no ~ expansion)...
 Android NDK: PLATFORM android-13 supports: arm mips x86
 Android NDK:   ABI arm sysroot is: C:/NVPACK/android-ndk-r12b/build//../platforms/android-13/arch-arm
 Android NDK:   ABI mips sysroot is: C:/NVPACK/android-ndk-r12b/build//../platforms/android-13/arch-mips
 Android NDK:   ABI x86 sysroot is: C:/NVPACK/android-ndk-r12b/build//../platforms/android-13/arch-x86
 Reading makefile `C:/NVPACK/android-ndk-r12b/build//../build/core/add-platform.mk' (search path) (no ~ expansion)...
 Android NDK: PLATFORM android-14 supports: arm mips x86
 Android NDK:   ABI arm sysroot is: C:/NVPACK/android-ndk-r12b/build//../platforms/android-14/arch-arm
 Android NDK:   ABI mips sysroot is: C:/NVPACK/android-ndk-r12b/build//../platforms/android-14/arch-mips
 Android NDK:   ABI x86 sysroot is: C:/NVPACK/android-ndk-r12b/build//../platforms/android-14/arch-x86
 Reading makefile `C:/NVPACK/android-ndk-r12b/build//../build/core/add-platform.mk' (search path) (no ~ expansion)...
 Android NDK: PLATFORM android-15 supports: arm mips x86
 Android NDK:   ABI arm sysroot is: C:/NVPACK/android-ndk-r12b/build//../platforms/android-15/arch-arm
 Android NDK:   ABI mips sysroot is: C:/NVPACK/android-ndk-r12b/build//../platforms/android-15/arch-mips
 Android NDK:   ABI x86 sysroot is: C:/NVPACK/android-ndk-r12b/build//../platforms/android-15/arch-x86
 Reading makefile `C:/NVPACK/android-ndk-r12b/build//../build/core/add-platform.mk' (search path) (no ~ expansion)...
 Android NDK: PLATFORM android-16 supports: arm mips x86
 Android NDK:   ABI arm sysroot is: C:/NVPACK/android-ndk-r12b/build//../platforms/android-16/arch-arm
 Android NDK:   ABI mips sysroot is: C:/NVPACK/android-ndk-r12b/build//../platforms/android-16/arch-mips
 Android NDK:   ABI x86 sysroot is: C:/NVPACK/android-ndk-r12b/build//../platforms/android-16/arch-x86
 Reading makefile `C:/NVPACK/android-ndk-r12b/build//../build/core/add-platform.mk' (search path) (no ~ expansion)...
 Android NDK: PLATFORM android-17 supports: arm mips x86
 Android NDK:   ABI arm sysroot is: C:/NVPACK/android-ndk-r12b/build//../platforms/android-17/arch-arm
 Android NDK:   ABI mips sysroot is: C:/NVPACK/android-ndk-r12b/build//../platforms/android-17/arch-mips
 Android NDK:   ABI x86 sysroot is: C:/NVPACK/android-ndk-r12b/build//../platforms/android-17/arch-x86
 Reading makefile `C:/NVPACK/android-ndk-r12b/build//../build/core/add-platform.mk' (search path) (no ~ expansion)...
 Android NDK: PLATFORM android-18 supports: arm mips x86
 Android NDK:   ABI arm sysroot is: C:/NVPACK/android-ndk-r12b/build//../platforms/android-18/arch-arm
 Android NDK:   ABI mips sysroot is: C:/NVPACK/android-ndk-r12b/build//../platforms/android-18/arch-mips
 Android NDK:   ABI x86 sysroot is: C:/NVPACK/android-ndk-r12b/build//../platforms/android-18/arch-x86
 Reading makefile `C:/NVPACK/android-ndk-r12b/build//../build/core/add-platform.mk' (search path) (no ~ expansion)...
 Android NDK: PLATFORM android-19 supports: arm mips x86
 Android NDK:   ABI arm sysroot is: C:/NVPACK/android-ndk-r12b/build//../platforms/android-19/arch-arm
 Android NDK:   ABI mips sysroot is: C:/NVPACK/android-ndk-r12b/build//../platforms/android-19/arch-mips
 Android NDK:   ABI x86 sysroot is: C:/NVPACK/android-ndk-r12b/build//../platforms/android-19/arch-x86
 Reading makefile `C:/NVPACK/android-ndk-r12b/build//../build/core/add-platform.mk' (search path) (no ~ expansion)...
 Android NDK: PLATFORM android-21 supports: arm arm64 mips mips64 x86 x86_64
 Android NDK:   ABI arm sysroot is: C:/NVPACK/android-ndk-r12b/build//../platforms/android-21/arch-arm
 Android NDK:   ABI arm64 sysroot is: C:/NVPACK/android-ndk-r12b/build//../platforms/android-21/arch-arm64
 Android NDK:   ABI mips sysroot is: C:/NVPACK/android-ndk-r12b/build//../platforms/android-21/arch-mips
 Android NDK:   ABI mips64 sysroot is: C:/NVPACK/android-ndk-r12b/build//../platforms/android-21/arch-mips64
 Android NDK:   ABI x86 sysroot is: C:/NVPACK/android-ndk-r12b/build//../platforms/android-21/arch-x86
 Android NDK:   ABI x86_64 sysroot is: C:/NVPACK/android-ndk-r12b/build//../platforms/android-21/arch-x86_64
 Reading makefile `C:/NVPACK/android-ndk-r12b/build//../build/core/add-platform.mk' (search path) (no ~ expansion)...
 Android NDK: PLATFORM android-22 supports: arm arm64 mips mips64 x86 x86_64
 Android NDK:   ABI arm sysroot is: C:/NVPACK/android-ndk-r12b/build//../platforms/android-22/arch-arm
 Android NDK:   ABI arm64 sysroot is: C:/NVPACK/android-ndk-r12b/build//../platforms/android-22/arch-arm64
 Android NDK:   ABI mips sysroot is: C:/NVPACK/android-ndk-r12b/build//../platforms/android-22/arch-mips
 Android NDK:   ABI mips64 sysroot is: C:/NVPACK/android-ndk-r12b/build//../platforms/android-22/arch-mips64
 Android NDK:   ABI x86 sysroot is: C:/NVPACK/android-ndk-r12b/build//../platforms/android-22/arch-x86
 Android NDK:   ABI x86_64 sysroot is: C:/NVPACK/android-ndk-r12b/build//../platforms/android-22/arch-x86_64
 Reading makefile `C:/NVPACK/android-ndk-r12b/build//../build/core/add-platform.mk' (search path) (no ~ expansion)...
 Android NDK: PLATFORM android-23 supports: arm arm64 mips mips64 x86 x86_64
 Android NDK:   ABI arm sysroot is: C:/NVPACK/android-ndk-r12b/build//../platforms/android-23/arch-arm
 Android NDK:   ABI arm64 sysroot is: C:/NVPACK/android-ndk-r12b/build//../platforms/android-23/arch-arm64
 Android NDK:   ABI mips sysroot is: C:/NVPACK/android-ndk-r12b/build//../platforms/android-23/arch-mips
 Android NDK:   ABI mips64 sysroot is: C:/NVPACK/android-ndk-r12b/build//../platforms/android-23/arch-mips64
 Android NDK:   ABI x86 sysroot is: C:/NVPACK/android-ndk-r12b/build//../platforms/android-23/arch-x86
 Android NDK:   ABI x86_64 sysroot is: C:/NVPACK/android-ndk-r12b/build//../platforms/android-23/arch-x86_64
 Reading makefile `C:/NVPACK/android-ndk-r12b/build//../build/core/add-platform.mk' (search path) (no ~ expansion)...
 Android NDK: PLATFORM android-24 supports: arm arm64 mips mips64 x86 x86_64
 Android NDK:   ABI arm sysroot is: C:/NVPACK/android-ndk-r12b/build//../platforms/android-24/arch-arm
 Android NDK:   ABI arm64 sysroot is: C:/NVPACK/android-ndk-r12b/build//../platforms/android-24/arch-arm64
 Android NDK:   ABI mips sysroot is: C:/NVPACK/android-ndk-r12b/build//../platforms/android-24/arch-mips
 Android NDK:   ABI mips64 sysroot is: C:/NVPACK/android-ndk-r12b/build//../platforms/android-24/arch-mips64
 Android NDK:   ABI x86 sysroot is: C:/NVPACK/android-ndk-r12b/build//../platforms/android-24/arch-x86
 Android NDK:   ABI x86_64 sysroot is: C:/NVPACK/android-ndk-r12b/build//../platforms/android-24/arch-x86_64
 Reading makefile `C:/NVPACK/android-ndk-r12b/build//../build/core/add-platform.mk' (search path) (no ~ expansion)...
 Android NDK: PLATFORM android-9 supports: arm mips x86
 Android NDK:   ABI arm sysroot is: C:/NVPACK/android-ndk-r12b/build//../platforms/android-9/arch-arm
 Android NDK:   ABI mips sysroot is: C:/NVPACK/android-ndk-r12b/build//../platforms/android-9/arch-mips
 Android NDK:   ABI x86 sysroot is: C:/NVPACK/android-ndk-r12b/build//../platforms/android-9/arch-x86
 Android NDK: Found stable platform levels: 12 13 14 15 16 17 18 19 21 22 23 24 9
 Android NDK: Found max platform level: 24
 Reading makefile `C:/NVPACK/android-ndk-r12b/build//../build/core/add-toolchain.mk' (search path) (no ~ expansion)...
 Reading makefile `C:/NVPACK/android-ndk-r12b/build//../build/core/toolchains/aarch64-linux-android-4.9/config.mk' (search path) (no ~ expansion)...
 Reading makefile `C:/NVPACK/android-ndk-r12b/build//../build/core/add-toolchain.mk' (search path) (no ~ expansion)...
 Reading makefile `C:/NVPACK/android-ndk-r12b/build//../build/core/toolchains/aarch64-linux-android-clang/config.mk' (search path) (no ~ expansion)...
 Reading makefile `C:/NVPACK/android-ndk-r12b/build//../build/core/add-toolchain.mk' (search path) (no ~ expansion)...
 Reading makefile `C:/NVPACK/android-ndk-r12b/build//../build/core/toolchains/arm-linux-androideabi-4.9/config.mk' (search path) (no ~ expansion)...
 Reading makefile `C:/NVPACK/android-ndk-r12b/build//../build/core/add-toolchain.mk' (search path) (no ~ expansion)...
 Reading makefile `C:/NVPACK/android-ndk-r12b/build//../build/core/toolchains/arm-linux-androideabi-clang/config.mk' (search path) (no ~ expansion)...
 Reading makefile `C:/NVPACK/android-ndk-r12b/build//../build/core/add-toolchain.mk' (search path) (no ~ expansion)...
 Reading makefile `C:/NVPACK/android-ndk-r12b/build//../build/core/toolchains/mips64el-linux-android-4.9/config.mk' (search path) (no ~ expansion)...
 Reading makefile `C:/NVPACK/android-ndk-r12b/build//../build/core/add-toolchain.mk' (search path) (no ~ expansion)...
 Reading makefile `C:/NVPACK/android-ndk-r12b/build//../build/core/toolchains/mips64el-linux-android-clang/config.mk' (search path) (no ~ expansion)...
 Reading makefile `C:/NVPACK/android-ndk-r12b/build//../build/core/add-toolchain.mk' (search path) (no ~ expansion)...
 Reading makefile `C:/NVPACK/android-ndk-r12b/build//../build/core/toolchains/mipsel-linux-android-4.9/config.mk' (search path) (no ~ expansion)...
 Reading makefile `C:/NVPACK/android-ndk-r12b/build//../build/core/add-toolchain.mk' (search path) (no ~ expansion)...
 Reading makefile `C:/NVPACK/android-ndk-r12b/build//../build/core/toolchains/mipsel-linux-android-clang/config.mk' (search path) (no ~ expansion)...
 Reading makefile `C:/NVPACK/android-ndk-r12b/build//../build/core/add-toolchain.mk' (search path) (no ~ expansion)...
 Reading makefile `C:/NVPACK/android-ndk-r12b/build//../build/core/toolchains/x86-4.9/config.mk' (search path) (no ~ expansion)...
 Reading makefile `C:/NVPACK/android-ndk-r12b/build//../build/core/add-toolchain.mk' (search path) (no ~ expansion)...
 Reading makefile `C:/NVPACK/android-ndk-r12b/build//../build/core/toolchains/x86-clang/config.mk' (search path) (no ~ expansion)...
 Reading makefile `C:/NVPACK/android-ndk-r12b/build//../build/core/add-toolchain.mk' (search path) (no ~ expansion)...
 Reading makefile `C:/NVPACK/android-ndk-r12b/build//../build/core/toolchains/x86_64-4.9/config.mk' (search path) (no ~ expansion)...
 Reading makefile `C:/NVPACK/android-ndk-r12b/build//../build/core/add-toolchain.mk' (search path) (no ~ expansion)...
 Reading makefile `C:/NVPACK/android-ndk-r12b/build//../build/core/toolchains/x86_64-clang/config.mk' (search path) (no ~ expansion)...
 Android NDK:  This NDK supports the following target architectures and ABIS:
 Android NDK:    arm: armeabi armeabi-v7a
 Android NDK:    arm64: arm64-v8a
 Android NDK:    mips: mips
 Android NDK:    mips64: mips64
 Android NDK:    x86: x86
 Android NDK:    x86_64: x86_64
 Android NDK:  This NDK supports the following toolchains and target ABIs:
 Android NDK:    aarch64-linux-android-4.9:  arm64-v8a
 Android NDK:    aarch64-linux-android-clang:  arm64-v8a
 Android NDK:    arm-linux-androideabi-4.9:  armeabi armeabi-v7a
 Android NDK:    arm-linux-androideabi-clang:  armeabi armeabi-v7a
 Android NDK:    mips64el-linux-android-4.9:  mips64
 Android NDK:    mips64el-linux-android-clang:  mips64
 Android NDK:    mipsel-linux-android-4.9:  mips
 Android NDK:    mipsel-linux-android-clang:  mips
 Android NDK:    x86-4.9:  x86
 Android NDK:    x86-clang:  x86
 Android NDK:    x86_64-4.9:  x86_64
 Android NDK:    x86_64-clang:  x86_64
 Android NDK: Found project path: D:/UnrealProjects/test2/test2/Intermediate/Android/APK
 Android NDK: Ouput path for intermediate files: D:/UnrealProjects/test2/test2/Intermediate/Android/APK/obj
 Android NDK: Ouput path for generated library files: D:/UnrealProjects/test2/test2/Intermediate/Android/APK/libs
 Reading makefile `C:/NVPACK/android-ndk-r12b/build//../build/core/add-application.mk' (search path) (no ~ expansion)...
 Android NDK: Parsing D:/UnrealProjects/test2/test2/Intermediate/Android/APK/jni/Application.mk
 Reading makefile `D:/UnrealProjects/test2/test2/Intermediate/Android/APK/jni/Application.mk' (search path) (no ~ expansion)...
 Android NDK:   APP_PIE is
 CreateProcess(C:\NVPACK\android-ndk-r12b\prebuilt\windows-x86_64\bin\awk.exe,C:/NVPACK/android-ndk-r12b/build//../prebuilt/windows-x86_64/bin/awk.exe -f C:/NVPACK/android-ndk-r12b/build//../build/awk/extract-minsdkversion.awk D:/UnrealProjects/test2/test2/Intermediate/Android/APK/AndroidManifest.xml,...)
 Android NDK:   Defaulted to APP_BUILD_SCRIPT=D:/UnrealProjects/test2/test2/Intermediate/Android/APK/jni/Android.mk
 Android NDK: Application 'local' forced debuggable through NDK_DEBUG
 Android NDK: Selecting debug optimization mode (app is debuggable)
 Reading makefile `C:/NVPACK/android-ndk-r12b/build//../build/core/setup-imports.mk' (search path) (no ~ expansion)...
 Android NDK: Adding import directory: C:/NVPACK/android-ndk-r12b/build//../sources
 Reading makefile `C:/NVPACK/android-ndk-r12b/build//../build/core/build-all.mk' (search path) (no ~ expansion)...
 Reading makefile `C:/NVPACK/android-ndk-r12b/build//../build/core/setup-app.mk' (search path) (no ~ expansion)...
 Reading makefile `C:/NVPACK/android-ndk-r12b/build//../build/core/setup-abi.mk' (search path) (no ~ expansion)...
 Android NDK: Building application 'local' for ABI 'arm64-v8a'
 Android NDK:   Enabling -fPIE for TARGET_PLATFORM android-21
 Reading makefile `C:/NVPACK/android-ndk-r12b/build//../build/core/setup-toolchain.mk' (search path) (no ~ expansion)...
 Android NDK: Using target toolchain 'aarch64-linux-android-4.9' for 'arm64-v8a' ABI
 Reading makefile `C:/NVPACK/android-ndk-r12b/build//../build/core/default-build-commands.mk' (search path) (no ~ expansion)...
 Reading makefile `C:/NVPACK/android-ndk-r12b/build//../build/core/toolchains/aarch64-linux-android-4.9/setup.mk' (search path) (no ~ expansion)...
 Android NDK: Looking for imported module with tag 'cxx-stl/system'
 Android NDK:   Probing C:/NVPACK/android-ndk-r12b/build//../sources/cxx-stl/system/Android.mk
 Android NDK:     Found in C:/NVPACK/android-ndk-r12b/build//../sources/cxx-stl/system
 Reading makefile `C:/NVPACK/android-ndk-r12b/build//../sources/cxx-stl/system/Android.mk' (search path) (no ~ expansion)...
 Reading makefile `C:/NVPACK/android-ndk-r12b/build//../build/core/clear-vars.mk' (search path) (no ~ expansion)...
 Reading makefile `C:/NVPACK/android-ndk-r12b/build//../build/core/build-static-library.mk' (search path) (no ~ expansion)...
 Reading makefile `C:/NVPACK/android-ndk-r12b/build//../build/core/build-module.mk' (search path) (no ~ expansion)...
 Reading makefile `D:/UnrealProjects/test2/test2/Intermediate/Android/APK/jni/Android.mk' (search path) (no ~ expansion)...
 Reading makefile `C:/NVPACK/android-ndk-r12b/build//../build/core/clear-vars.mk' (search path) (no ~ expansion)...
 Reading makefile `C:/NVPACK/android-ndk-r12b/build//../build/core/prebuilt-shared-library.mk' (search path) (no ~ expansion)...
 Reading makefile `C:/NVPACK/android-ndk-r12b/build//../build/core/prebuilt-library.mk' (search path) (no ~ expansion)...
 Reading makefile `C:/NVPACK/android-ndk-r12b/build//../build/core/build-module.mk' (search path) (no ~ expansion)...
 Reading makefile `C:/NVPACK/android-ndk-r12b/build//../build/core/build-binary.mk' (search path) (no ~ expansion)...
 Reading makefile `C:/NVPACK/android-ndk-r12b/build//../build/core/import-locals.mk' (search path) (no ~ expansion)...
 Reading makefile `C:/NVPACK/android-ndk-r12b/build//../build/core/build-binary.mk' (search path) (no ~ expansion)...
 Reading makefile `C:/NVPACK/android-ndk-r12b/build//../build/core/import-locals.mk' (search path) (no ~ expansion)...
 Android NDK: [arm64-v8a] Modules to build: UE4
 Updating makefiles....
  Considering target file `C:/NVPACK/android-ndk-r12b/build//../build/core/import-locals.mk'.
   Looking for an implicit rule for `C:/NVPACK/android-ndk-r12b/build//../build/core/import-locals.mk'.
   No implicit rule found for `C:/NVPACK/android-ndk-r12b/build//../build/core/import-locals.mk'.
   Finished prerequisites of target file `C:/NVPACK/android-ndk-r12b/build//../build/core/import-locals.mk'.
  No need to remake target `C:/NVPACK/android-ndk-r12b/build//../build/core/import-locals.mk'.
  Considering target file `C:/NVPACK/android-ndk-r12b/build//../build/core/build-binary.mk'.
   Looking for an implicit rule for `C:/NVPACK/android-ndk-r12b/build//../build/core/build-binary.mk'.
   No implicit rule found for `C:/NVPACK/android-ndk-r12b/build//../build/core/build-binary.mk'.
   Finished prerequisites of target file `C:/NVPACK/android-ndk-r12b/build//../build/core/build-binary.mk'.
  No need to remake target `C:/NVPACK/android-ndk-r12b/build//../build/core/build-binary.mk'.
  Pruning file `C:/NVPACK/android-ndk-r12b/build//../build/core/import-locals.mk'.
  Pruning file `C:/NVPACK/android-ndk-r12b/build//../build/core/build-binary.mk'.
  Considering target file `C:/NVPACK/android-ndk-r12b/build//../build/core/build-module.mk'.
   Looking for an implicit rule for `C:/NVPACK/android-ndk-r12b/build//../build/core/build-module.mk'.
   No implicit rule found for `C:/NVPACK/android-ndk-r12b/build//../build/core/build-module.mk'.
   Finished prerequisites of target file `C:/NVPACK/android-ndk-r12b/build//../build/core/build-module.mk'.
  No need to remake target `C:/NVPACK/android-ndk-r12b/build//../build/core/build-module.mk'.
  Considering target file `C:/NVPACK/android-ndk-r12b/build//../build/core/prebuilt-library.mk'.
   Looking for an implicit rule for `C:/NVPACK/android-ndk-r12b/build//../build/core/prebuilt-library.mk'.
   No implicit rule found for `C:/NVPACK/android-ndk-r12b/build//../build/core/prebuilt-library.mk'.
   Finished prerequisites of target file `C:/NVPACK/android-ndk-r12b/build//../build/core/prebuilt-library.mk'.
  No need to remake target `C:/NVPACK/android-ndk-r12b/build//../build/core/prebuilt-library.mk'.
  Considering target file `C:/NVPACK/android-ndk-r12b/build//../build/core/prebuilt-shared-library.mk'.
   Looking for an implicit rule for `C:/NVPACK/android-ndk-r12b/build//../build/core/prebuilt-shared-library.mk'.
   No implicit rule found for `C:/NVPACK/android-ndk-r12b/build//../build/core/prebuilt-shared-library.mk'.
   Finished prerequisites of target file `C:/NVPACK/android-ndk-r12b/build//../build/core/prebuilt-shared-library.mk'.
  No need to remake target `C:/NVPACK/android-ndk-r12b/build//../build/core/prebuilt-shared-library.mk'.
  Considering target file `C:/NVPACK/android-ndk-r12b/build//../build/core/clear-vars.mk'.
   Looking for an implicit rule for `C:/NVPACK/android-ndk-r12b/build//../build/core/clear-vars.mk'.
   No implicit rule found for `C:/NVPACK/android-ndk-r12b/build//../build/core/clear-vars.mk'.
   Finished prerequisites of target file `C:/NVPACK/android-ndk-r12b/build//../build/core/clear-vars.mk'.
  No need to remake target `C:/NVPACK/android-ndk-r12b/build//../build/core/clear-vars.mk'.
  Considering target file `D:/UnrealProjects/test2/test2/Intermediate/Android/APK/jni/Android.mk'.
   Looking for an implicit rule for `D:/UnrealProjects/test2/test2/Intermediate/Android/APK/jni/Android.mk'.
   No implicit rule found for `D:/UnrealProjects/test2/test2/Intermediate/Android/APK/jni/Android.mk'.
   Finished prerequisites of target file `D:/UnrealProjects/test2/test2/Intermediate/Android/APK/jni/Android.mk'.
  No need to remake target `D:/UnrealProjects/test2/test2/Intermediate/Android/APK/jni/Android.mk'.
  Pruning file `C:/NVPACK/android-ndk-r12b/build//../build/core/build-module.mk'.
  Considering target file `C:/NVPACK/android-ndk-r12b/build//../build/core/build-static-library.mk'.
   Looking for an implicit rule for `C:/NVPACK/android-ndk-r12b/build//../build/core/build-static-library.mk'.
   No implicit rule found for `C:/NVPACK/android-ndk-r12b/build//../build/core/build-static-library.mk'.
   Finished prerequisites of target file `C:/NVPACK/android-ndk-r12b/build//../build/core/build-static-library.mk'.
  No need to remake target `C:/NVPACK/android-ndk-r12b/build//../build/core/build-static-library.mk'.
  Pruning file `C:/NVPACK/android-ndk-r12b/build//../build/core/clear-vars.mk'.
  Considering target file `C:/NVPACK/android-ndk-r12b/build//../sources/cxx-stl/system/Android.mk'.
   Looking for an implicit rule for `C:/NVPACK/android-ndk-r12b/build//../sources/cxx-stl/system/Android.mk'.
   No implicit rule found for `C:/NVPACK/android-ndk-r12b/build//../sources/cxx-stl/system/Android.mk'.
   Finished prerequisites of target file `C:/NVPACK/android-ndk-r12b/build//../sources/cxx-stl/system/Android.mk'.
  No need to remake target `C:/NVPACK/android-ndk-r12b/build//../sources/cxx-stl/system/Android.mk'.
  Considering target file `C:/NVPACK/android-ndk-r12b/build//../build/core/toolchains/aarch64-linux-android-4.9/setup.mk'.
   Looking for an implicit rule for `C:/NVPACK/android-ndk-r12b/build//../build/core/toolchains/aarch64-linux-android-4.9/setup.mk'.
   No implicit rule found for `C:/NVPACK/android-ndk-r12b/build//../build/core/toolchains/aarch64-linux-android-4.9/setup.mk'.
   Finished prerequisites of target file `C:/NVPACK/android-ndk-r12b/build//../build/core/toolchains/aarch64-linux-android-4.9/setup.mk'.
  No need to remake target `C:/NVPACK/android-ndk-r12b/build//../build/core/toolchains/aarch64-linux-android-4.9/setup.mk'.
  Considering target file `C:/NVPACK/android-ndk-r12b/build//../build/core/default-build-commands.mk'.
   Looking for an implicit rule for `C:/NVPACK/android-ndk-r12b/build//../build/core/default-build-commands.mk'.
   No implicit rule found for `C:/NVPACK/android-ndk-r12b/build//../build/core/default-build-commands.mk'.
   Finished prerequisites of target file `C:/NVPACK/android-ndk-r12b/build//../build/core/default-build-commands.mk'.
  No need to remake target `C:/NVPACK/android-ndk-r12b/build//../build/core/default-build-commands.mk'.
  Considering target file `C:/NVPACK/android-ndk-r12b/build//../build/core/setup-toolchain.mk'.
   Looking for an implicit rule for `C:/NVPACK/android-ndk-r12b/build//../build/core/setup-toolchain.mk'.
   No implicit rule found for `C:/NVPACK/android-ndk-r12b/build//../build/core/setup-toolchain.mk'.
   Finished prerequisites of target file `C:/NVPACK/android-ndk-r12b/build//../build/core/setup-toolchain.mk'.
  No need to remake target `C:/NVPACK/android-ndk-r12b/build//../build/core/setup-toolchain.mk'.
  Considering target file `C:/NVPACK/android-ndk-r12b/build//../build/core/setup-abi.mk'.
   Looking for an implicit rule for `C:/NVPACK/android-ndk-r12b/build//../build/core/setup-abi.mk'.
   No implicit rule found for `C:/NVPACK/android-ndk-r12b/build//../build/core/setup-abi.mk'.
   Finished prerequisites of target file `C:/NVPACK/android-ndk-r12b/build//../build/core/setup-abi.mk'.
  No need to remake target `C:/NVPACK/android-ndk-r12b/build//../build/core/setup-abi.mk'.
  Considering target file `C:/NVPACK/android-ndk-r12b/build//../build/core/setup-app.mk'.
   Looking for an implicit rule for `C:/NVPACK/android-ndk-r12b/build//../build/core/setup-app.mk'.
   No implicit rule found for `C:/NVPACK/android-ndk-r12b/build//../build/core/setup-app.mk'.
   Finished prerequisites of target file `C:/NVPACK/android-ndk-r12b/build//../build/core/setup-app.mk'.
  No need to remake target `C:/NVPACK/android-ndk-r12b/build//../build/core/setup-app.mk'.
  Considering target file `C:/NVPACK/android-ndk-r12b/build//../build/core/build-all.mk'.
   Looking for an implicit rule for `C:/NVPACK/android-ndk-r12b/build//../build/core/build-all.mk'.
   No implicit rule found for `C:/NVPACK/android-ndk-r12b/build//../build/core/build-all.mk'.
   Finished prerequisites of target file `C:/NVPACK/android-ndk-r12b/build//../build/core/build-all.mk'.
  No need to remake target `C:/NVPACK/android-ndk-r12b/build//../build/core/build-all.mk'.
  Considering target file `C:/NVPACK/android-ndk-r12b/build//../build/core/setup-imports.mk'.
   Looking for an implicit rule for `C:/NVPACK/android-ndk-r12b/build//../build/core/setup-imports.mk'.
   No implicit rule found for `C:/NVPACK/android-ndk-r12b/build//../build/core/setup-imports.mk'.
   Finished prerequisites of target file `C:/NVPACK/android-ndk-r12b/build//../build/core/setup-imports.mk'.
  No need to remake target `C:/NVPACK/android-ndk-r12b/build//../build/core/setup-imports.mk'.
  Considering target file `D:/UnrealProjects/test2/test2/Intermediate/Android/APK/jni/Application.mk'.
   Looking for an implicit rule for `D:/UnrealProjects/test2/test2/Intermediate/Android/APK/jni/Application.mk'.
   No implicit rule found for `D:/UnrealProjects/test2/test2/Intermediate/Android/APK/jni/Application.mk'.
   Finished prerequisites of target file `D:/UnrealProjects/test2/test2/Intermediate/Android/APK/jni/Application.mk'.
  No need to remake target `D:/UnrealProjects/test2/test2/Intermediate/Android/APK/jni/Application.mk'.
  Considering target file `C:/NVPACK/android-ndk-r12b/build//../build/core/add-application.mk'.
   Looking for an implicit rule for `C:/NVPACK/android-ndk-r12b/build//../build/core/add-application.mk'.
   No implicit rule found for `C:/NVPACK/android-ndk-r12b/build//../build/core/add-application.mk'.
   Finished prerequisites of target file `C:/NVPACK/android-ndk-r12b/build//../build/core/add-application.mk'.
  No need to remake target `C:/NVPACK/android-ndk-r12b/build//../build/core/add-application.mk'.
  Considering target file `C:/NVPACK/android-ndk-r12b/build//../build/core/toolchains/x86_64-clang/config.mk'.
   Looking for an implicit rule for `C:/NVPACK/android-ndk-r12b/build//../build/core/toolchains/x86_64-clang/config.mk'.
   No implicit rule found for `C:/NVPACK/android-ndk-r12b/build//../build/core/toolchains/x86_64-clang/config.mk'.
   Finished prerequisites of target file `C:/NVPACK/android-ndk-r12b/build//../build/core/toolchains/x86_64-clang/config.mk'.
  No need to remake target `C:/NVPACK/android-ndk-r12b/build//../build/core/toolchains/x86_64-clang/config.mk'.
  Considering target file `C:/NVPACK/android-ndk-r12b/build//../build/core/add-toolchain.mk'.
   Looking for an implicit rule for `C:/NVPACK/android-ndk-r12b/build//../build/core/add-toolchain.mk'.
   No implicit rule found for `C:/NVPACK/android-ndk-r12b/build//../build/core/add-toolchain.mk'.
   Finished prerequisites of target file `C:/NVPACK/android-ndk-r12b/build//../build/core/add-toolchain.mk'.
  No need to remake target `C:/NVPACK/android-ndk-r12b/build//../build/core/add-toolchain.mk'.
  Considering target file `C:/NVPACK/android-ndk-r12b/build//../build/core/toolchains/x86_64-4.9/config.mk'.
   Looking for an implicit rule for `C:/NVPACK/android-ndk-r12b/build//../build/core/toolchains/x86_64-4.9/config.mk'.
   No implicit rule found for `C:/NVPACK/android-ndk-r12b/build//../build/core/toolchains/x86_64-4.9/config.mk'.
   Finished prerequisites of target file `C:/NVPACK/android-ndk-r12b/build//../build/core/toolchains/x86_64-4.9/config.mk'.
  No need to remake target `C:/NVPACK/android-ndk-r12b/build//../build/core/toolchains/x86_64-4.9/config.mk'.
  Pruning file `C:/NVPACK/android-ndk-r12b/build//../build/core/add-toolchain.mk'.
  Considering target file `C:/NVPACK/android-ndk-r12b/build//../build/core/toolchains/x86-clang/config.mk'.
   Looking for an implicit rule for `C:/NVPACK/android-ndk-r12b/build//../build/core/toolchains/x86-clang/config.mk'.
   No implicit rule found for `C:/NVPACK/android-ndk-r12b/build//../build/core/toolchains/x86-clang/config.mk'.
   Finished prerequisites of target file `C:/NVPACK/android-ndk-r12b/build//../build/core/toolchains/x86-clang/config.mk'.
  No need to remake target `C:/NVPACK/android-ndk-r12b/build//../build/core/toolchains/x86-clang/config.mk'.
  Pruning file `C:/NVPACK/android-ndk-r12b/build//../build/core/add-toolchain.mk'.
  Considering target file `C:/NVPACK/android-ndk-r12b/build//../build/core/toolchains/x86-4.9/config.mk'.
   Looking for an implicit rule for `C:/NVPACK/android-ndk-r12b/build//../build/core/toolchains/x86-4.9/config.mk'.
   No implicit rule found for `C:/NVPACK/android-ndk-r12b/build//../build/core/toolchains/x86-4.9/config.mk'.
   Finished prerequisites of target file `C:/NVPACK/android-ndk-r12b/build//../build/core/toolchains/x86-4.9/config.mk'.
  No need to remake target `C:/NVPACK/android-ndk-r12b/build//../build/core/toolchains/x86-4.9/config.mk'.
  Pruning file `C:/NVPACK/android-ndk-r12b/build//../build/core/add-toolchain.mk'.
  Considering target file `C:/NVPACK/android-ndk-r12b/build//../build/core/toolchains/mipsel-linux-android-clang/config.mk'.
   Looking for an implicit rule for `C:/NVPACK/android-ndk-r12b/build//../build/core/toolchains/mipsel-linux-android-clang/config.mk'.
   No implicit rule found for `C:/NVPACK/android-ndk-r12b/build//../build/core/toolchains/mipsel-linux-android-clang/config.mk'.
   Finished prerequisites of target file `C:/NVPACK/android-ndk-r12b/build//../build/core/toolchains/mipsel-linux-android-clang/config.mk'.
  No need to remake target `C:/NVPACK/android-ndk-r12b/build//../build/core/toolchains/mipsel-linux-android-clang/config.mk'.
  Pruning file `C:/NVPACK/android-ndk-r12b/build//../build/core/add-toolchain.mk'.
  Considering target file `C:/NVPACK/android-ndk-r12b/build//../build/core/toolchains/mipsel-linux-android-4.9/config.mk'.
   Looking for an implicit rule for `C:/NVPACK/android-ndk-r12b/build//../build/core/toolchains/mipsel-linux-android-4.9/config.mk'.
   No implicit rule found for `C:/NVPACK/android-ndk-r12b/build//../build/core/toolchains/mipsel-linux-android-4.9/config.mk'.
   Finished prerequisites of target file `C:/NVPACK/android-ndk-r12b/build//../build/core/toolchains/mipsel-linux-android-4.9/config.mk'.
  No need to remake target `C:/NVPACK/android-ndk-r12b/build//../build/core/toolchains/mipsel-linux-android-4.9/config.mk'.
  Pruning file `C:/NVPACK/android-ndk-r12b/build//../build/core/add-toolchain.mk'.
  Considering target file `C:/NVPACK/android-ndk-r12b/build//../build/core/toolchains/mips64el-linux-android-clang/config.mk'.
   Looking for an implicit rule for `C:/NVPACK/android-ndk-r12b/build//../build/core/toolchains/mips64el-linux-android-clang/config.mk'.
   No implicit rule found for `C:/NVPACK/android-ndk-r12b/build//../build/core/toolchains/mips64el-linux-android-clang/config.mk'.
   Finished prerequisites of target file `C:/NVPACK/android-ndk-r12b/build//../build/core/toolchains/mips64el-linux-android-clang/config.mk'.
  No need to remake target `C:/NVPACK/android-ndk-r12b/build//../build/core/toolchains/mips64el-linux-android-clang/config.mk'.
  Pruning file `C:/NVPACK/android-ndk-r12b/build//../build/core/add-toolchain.mk'.
  Considering target file `C:/NVPACK/android-ndk-r12b/build//../build/core/toolchains/mips64el-linux-android-4.9/config.mk'.
   Looking for an implicit rule for `C:/NVPACK/android-ndk-r12b/build//../build/core/toolchains/mips64el-linux-android-4.9/config.mk'.
   No implicit rule found for `C:/NVPACK/android-ndk-r12b/build//../build/core/toolchains/mips64el-linux-android-4.9/config.mk'.
   Finished prerequisites of target file `C:/NVPACK/android-ndk-r12b/build//../build/core/toolchains/mips64el-linux-android-4.9/config.mk'.
  No need to remake target `C:/NVPACK/android-ndk-r12b/build//../build/core/toolchains/mips64el-linux-android-4.9/config.mk'.
  Pruning file `C:/NVPACK/android-ndk-r12b/build//../build/core/add-toolchain.mk'.
  Considering target file `C:/NVPACK/android-ndk-r12b/build//../build/core/toolchains/arm-linux-androideabi-clang/config.mk'.
   Looking for an implicit rule for `C:/NVPACK/android-ndk-r12b/build//../build/core/toolchains/arm-linux-androideabi-clang/config.mk'.
   No implicit rule found for `C:/NVPACK/android-ndk-r12b/build//../build/core/toolchains/arm-linux-androideabi-clang/config.mk'.
   Finished prerequisites of target file `C:/NVPACK/android-ndk-r12b/build//../build/core/toolchains/arm-linux-androideabi-clang/config.mk'.
  No need to remake target `C:/NVPACK/android-ndk-r12b/build//../build/core/toolchains/arm-linux-androideabi-clang/config.mk'.
  Pruning file `C:/NVPACK/android-ndk-r12b/build//../build/core/add-toolchain.mk'.
  Considering target file `C:/NVPACK/android-ndk-r12b/build//../build/core/toolchains/arm-linux-androideabi-4.9/config.mk'.
   Looking for an implicit rule for `C:/NVPACK/android-ndk-r12b/build//../build/core/toolchains/arm-linux-androideabi-4.9/config.mk'.
   No implicit rule found for `C:/NVPACK/android-ndk-r12b/build//../build/core/toolchains/arm-linux-androideabi-4.9/config.mk'.
   Finished prerequisites of target file `C:/NVPACK/android-ndk-r12b/build//../build/core/toolchains/arm-linux-androideabi-4.9/config.mk'.
  No need to remake target `C:/NVPACK/android-ndk-r12b/build//../build/core/toolchains/arm-linux-androideabi-4.9/config.mk'.
  Pruning file `C:/NVPACK/android-ndk-r12b/build//../build/core/add-toolchain.mk'.
  Considering target file `C:/NVPACK/android-ndk-r12b/build//../build/core/toolchains/aarch64-linux-android-clang/config.mk'.
   Looking for an implicit rule for `C:/NVPACK/android-ndk-r12b/build//../build/core/toolchains/aarch64-linux-android-clang/config.mk'.
   No implicit rule found for `C:/NVPACK/android-ndk-r12b/build//../build/core/toolchains/aarch64-linux-android-clang/config.mk'.
   Finished prerequisites of target file `C:/NVPACK/android-ndk-r12b/build//../build/core/toolchains/aarch64-linux-android-clang/config.mk'.
  No need to remake target `C:/NVPACK/android-ndk-r12b/build//../build/core/toolchains/aarch64-linux-android-clang/config.mk'.
  Pruning file `C:/NVPACK/android-ndk-r12b/build//../build/core/add-toolchain.mk'.
  Considering target file `C:/NVPACK/android-ndk-r12b/build//../build/core/toolchains/aarch64-linux-android-4.9/config.mk'.
   Looking for an implicit rule for `C:/NVPACK/android-ndk-r12b/build//../build/core/toolchains/aarch64-linux-android-4.9/config.mk'.
   No implicit rule found for `C:/NVPACK/android-ndk-r12b/build//../build/core/toolchains/aarch64-linux-android-4.9/config.mk'.
   Finished prerequisites of target file `C:/NVPACK/android-ndk-r12b/build//../build/core/toolchains/aarch64-linux-android-4.9/config.mk'.
  No need to remake target `C:/NVPACK/android-ndk-r12b/build//../build/core/toolchains/aarch64-linux-android-4.9/config.mk'.
  Pruning file `C:/NVPACK/android-ndk-r12b/build//../build/core/add-toolchain.mk'.
  Considering target file `C:/NVPACK/android-ndk-r12b/build//../build/core/add-platform.mk'.
   Looking for an implicit rule for `C:/NVPACK/android-ndk-r12b/build//../build/core/add-platform.mk'.
   No implicit rule found for `C:/NVPACK/android-ndk-r12b/build//../build/core/add-platform.mk'.
   Finished prerequisites of target file `C:/NVPACK/android-ndk-r12b/build//../build/core/add-platform.mk'.
  No need to remake target `C:/NVPACK/android-ndk-r12b/build//../build/core/add-platform.mk'.
  Pruning file `C:/NVPACK/android-ndk-r12b/build//../build/core/add-platform.mk'.
  Pruning file `C:/NVPACK/android-ndk-r12b/build//../build/core/add-platform.mk'.
  Pruning file `C:/NVPACK/android-ndk-r12b/build//../build/core/add-platform.mk'.
  Pruning file `C:/NVPACK/android-ndk-r12b/build//../build/core/add-platform.mk'.
  Pruning file `C:/NVPACK/android-ndk-r12b/build//../build/core/add-platform.mk'.
  Pruning file `C:/NVPACK/android-ndk-r12b/build//../build/core/add-platform.mk'.
  Pruning file `C:/NVPACK/android-ndk-r12b/build//../build/core/add-platform.mk'.
  Pruning file `C:/NVPACK/android-ndk-r12b/build//../build/core/add-platform.mk'.
  Pruning file `C:/NVPACK/android-ndk-r12b/build//../build/core/add-platform.mk'.
  Pruning file `C:/NVPACK/android-ndk-r12b/build//../build/core/add-platform.mk'.
  Pruning file `C:/NVPACK/android-ndk-r12b/build//../build/core/add-platform.mk'.
  Pruning file `C:/NVPACK/android-ndk-r12b/build//../build/core/add-platform.mk'.
  Considering target file `C:/NVPACK/android-ndk-r12b/build//../build/core/definitions-graph.mk'.
   Looking for an implicit rule for `C:/NVPACK/android-ndk-r12b/build//../build/core/definitions-graph.mk'.
   No implicit rule found for `C:/NVPACK/android-ndk-r12b/build//../build/core/definitions-graph.mk'.
   Finished prerequisites of target file `C:/NVPACK/android-ndk-r12b/build//../build/core/definitions-graph.mk'.
  No need to remake target `C:/NVPACK/android-ndk-r12b/build//../build/core/definitions-graph.mk'.
  Considering target file `C:/NVPACK/android-ndk-r12b/build//../build/core/definitions-host.mk'.
   Looking for an implicit rule for `C:/NVPACK/android-ndk-r12b/build//../build/core/definitions-host.mk'.
   No implicit rule found for `C:/NVPACK/android-ndk-r12b/build//../build/core/definitions-host.mk'.
   Finished prerequisites of target file `C:/NVPACK/android-ndk-r12b/build//../build/core/definitions-host.mk'.
  No need to remake target `C:/NVPACK/android-ndk-r12b/build//../build/core/definitions-host.mk'.
  Considering target file `C:/NVPACK/android-ndk-r12b/build//../build/core/definitions-utils.mk'.
   Looking for an implicit rule for `C:/NVPACK/android-ndk-r12b/build//../build/core/definitions-utils.mk'.
   No implicit rule found for `C:/NVPACK/android-ndk-r12b/build//../build/core/definitions-utils.mk'.
   Finished prerequisites of target file `C:/NVPACK/android-ndk-r12b/build//../build/core/definitions-utils.mk'.
  No need to remake target `C:/NVPACK/android-ndk-r12b/build//../build/core/definitions-utils.mk'.
  Considering target file `C:/NVPACK/android-ndk-r12b/build//../build/core/definitions-tests.mk'.
   Looking for an implicit rule for `C:/NVPACK/android-ndk-r12b/build//../build/core/definitions-tests.mk'.
   No implicit rule found for `C:/NVPACK/android-ndk-r12b/build//../build/core/definitions-tests.mk'.
   Finished prerequisites of target file `C:/NVPACK/android-ndk-r12b/build//../build/core/definitions-tests.mk'.
  No need to remake target `C:/NVPACK/android-ndk-r12b/build//../build/core/definitions-tests.mk'.
  Considering target file `C:/NVPACK/android-ndk-r12b/build//../build/gmsl/__gmsl'.
   Looking for an implicit rule for `C:/NVPACK/android-ndk-r12b/build//../build/gmsl/__gmsl'.
   No implicit rule found for `C:/NVPACK/android-ndk-r12b/build//../build/gmsl/__gmsl'.
   Finished prerequisites of target file `C:/NVPACK/android-ndk-r12b/build//../build/gmsl/__gmsl'.
  No need to remake target `C:/NVPACK/android-ndk-r12b/build//../build/gmsl/__gmsl'.
  Considering target file `C:/NVPACK/android-ndk-r12b/build//../build/gmsl/gmsl'.
   Looking for an implicit rule for `C:/NVPACK/android-ndk-r12b/build//../build/gmsl/gmsl'.
   No implicit rule found for `C:/NVPACK/android-ndk-r12b/build//../build/gmsl/gmsl'.
   Finished prerequisites of target file `C:/NVPACK/android-ndk-r12b/build//../build/gmsl/gmsl'.
  No need to remake target `C:/NVPACK/android-ndk-r12b/build//../build/gmsl/gmsl'.
  Considering target file `C:/NVPACK/android-ndk-r12b/build//../build/core/definitions.mk'.
   Looking for an implicit rule for `C:/NVPACK/android-ndk-r12b/build//../build/core/definitions.mk'.
   No implicit rule found for `C:/NVPACK/android-ndk-r12b/build//../build/core/definitions.mk'.
   Finished prerequisites of target file `C:/NVPACK/android-ndk-r12b/build//../build/core/definitions.mk'.
  No need to remake target `C:/NVPACK/android-ndk-r12b/build//../build/core/definitions.mk'.
  Considering target file `C:/NVPACK/android-ndk-r12b/build//../build/core/init.mk'.
   Looking for an implicit rule for `C:/NVPACK/android-ndk-r12b/build//../build/core/init.mk'.
   No implicit rule found for `C:/NVPACK/android-ndk-r12b/build//../build/core/init.mk'.
   Finished prerequisites of target file `C:/NVPACK/android-ndk-r12b/build//../build/core/init.mk'.
  No need to remake target `C:/NVPACK/android-ndk-r12b/build//../build/core/init.mk'.
  Considering target file `C:\NVPACK\android-ndk-r12b\build\\..\build\core\build-local.mk'.
   Looking for an implicit rule for `C:\NVPACK\android-ndk-r12b\build\\..\build\core\build-local.mk'.
   No implicit rule found for `C:\NVPACK\android-ndk-r12b\build\\..\build\core\build-local.mk'.
   Finished prerequisites of target file `C:\NVPACK\android-ndk-r12b\build\\..\build\core\build-local.mk'.
  No need to remake target `C:\NVPACK\android-ndk-r12b\build\\..\build\core\build-local.mk'.
 Updating goal targets....
 Considering target file `all'.
  File `all' does not exist.
   Considering target file `installed_modules'.
    File `installed_modules' does not exist.
     Considering target file `D:/UnrealProjects/test2/test2/Intermediate/Android/APK/libs/arm64-v8a/gdbserver'.
      File `D:/UnrealProjects/test2/test2/Intermediate/Android/APK/libs/arm64-v8a/gdbserver' does not exist.
       Considering target file `clean-installed-binaries'.
        File `clean-installed-binaries' does not exist.
        Finished prerequisites of target file `clean-installed-binaries'.
       Target `clean-installed-binaries' is double-colon and has no prerequisites.
       Must remake target `clean-installed-binaries'.
       Successfully remade target file `clean-installed-binaries'.
       Considering target file `clean-installed-binaries'.
        File `clean-installed-binaries' does not exist.
        Finished prerequisites of target file `clean-installed-binaries'.
       Target `clean-installed-binaries' is double-colon and has no prerequisites.
       Must remake target `clean-installed-binaries'.
       Successfully remade target file `clean-installed-binaries'.
       Considering target file `D:/UnrealProjects/test2/test2/Intermediate/Android/APK/libs/arm64-v8a'.
        File `D:/UnrealProjects/test2/test2/Intermediate/Android/APK/libs/arm64-v8a' does not exist.
        Finished prerequisites of target file `D:/UnrealProjects/test2/test2/Intermediate/Android/APK/libs/arm64-v8a'.
       Must remake target `D:/UnrealProjects/test2/test2/Intermediate/Android/APK/libs/arm64-v8a'.
 Creating temporary batch file C:\Users\PANDA&~1\AppData\Local\Temp\make7128-1.bat
 CreateProcess(C:\Users\PANDA&~1\AppData\Local\Temp\make7128-1.bat,C:\Users\PANDA&~1\AppData\Local\Temp\make7128-1.bat,...)
 Putting child 0000000000E3C8C0 (D:/UnrealProjects/test2/test2/Intermediate/Android/APK/libs/arm64-v8a) PID 14325744 on the chain.
 "C:\Users\PANDA" не является внутренней или внешней
 командой, исполняемой программой или пакетным файлом.
 Live child 0000000000E3C8C0 (D:/UnrealProjects/testСистеме не удается найти указанный путь.
 2/test2/Intermediate/Android/APK/libs/arm64-v8a) PID 14325744
 Reaping losing child 0000000000E3C8C0 PID 14325744
 Cleaning up temp batch file C:\Users\PANDA&~1\AppData\Local\Temp\make7128-1.bat
 make: *** [D:/UnrealProjects/test2/test2/Intermediate/Android/APK/libs/arm64-v8a] Error 1
 Removing child 0000000000E3C8C0 PID 14325744 from chain.
more ▼

answered Jul 17 '17 at 07:00 PM

avatar image

m.a.kutuzov
17 3 3 7

(comments are locked)
10|2000 characters needed characters left
Viewable by all users
Your answer
toggle preview:

Up to 5 attachments (including images) can be used with a maximum of 5.2 MB each and 5.2 MB total.

Follow this question

Once you sign in you will be able to subscribe for any updates here

Answers to this question