x

Search in
Sort by:

Question Status:

Search help

  • Simple searches use one or more words. Separate the words with spaces (cat dog) to search cat,dog or both. Separate the words with plus signs (cat +dog) to search for items that may contain cat but must contain dog.
  • You can further refine your search on the search results page, where you can search by keywords, author, topic. These can be combined with each other. Examples
    • cat dog --matches anything with cat,dog or both
    • cat +dog --searches for cat +dog where dog is a mandatory term
    • cat -dog -- searches for cat excluding any result containing dog
    • [cats] —will restrict your search to results with topic named "cats"
    • [cats] [dogs] —will restrict your search to results with both topics, "cats", and "dogs"

UnrealEngine/Engine/Source/ThirdParty/Linux/LibCxx/include/c++/v1/cstddef:43:15: fatal error: 'stddef.h' file not found #include_next #455

When i compile the UnrealEngine4.17 source code in ubuntu 16.04 , both the ./Setup.sh and ./GenerateProjectFiles.sh are successful, but when type "make" command, the message is as follow:

ddname-pc:~/UnrealEngine$ make bash "/home/ddname/UnrealEngine/Engine/Build/BatchFiles/Linux/Build.sh" CrashReportClient Linux Shipping Building CrashReportClient... Creating makefile for CrashReportClient (no existing makefile) Performing full C++ include scan (no include cache file) Using clang version '3.8.0' (string), 3 (major), 8 (minor), 0 (patch) Building UnrealHeaderTool... Creating makefile for UnrealHeaderTool (no existing makefile) Performing full C++ include scan (no include cache file) Using clang version '3.8.0' (string), 3 (major), 8 (minor), 0 (patch) Using bundled libc++ standard C++ library. Using fast way to relink circularly dependent libraries (no FixDeps). Performing 25 actions (12 in parallel) [3/25] Compile SharedPCH.Core.h [4/25] Compile Module.UnrealHeaderTool.cpp [1/25] Compile PCH.Core.h [2/25] Compile PCH.CoreUObject.h In file included from /home/ddname/UnrealEngine/Engine/Intermediate/Build/Linux/B4D820EA/UnrealHeaderTool/Development/Core/PCH.Core.h:46: In file included from /home/ddname/UnrealEngine/Engine/Source/Runtime/Core/Private/CorePrivatePCH.h:10: In file included from Runtime/Core/Public/GenericPlatform/GenericPlatformMisc.h:7: In file included from Runtime/Core/Public/HAL/PlatformCrt.h:5: In file included from ThirdParty/Linux/LibCxx/include/c++/v1/new:70: In file included from ThirdParty/Linux/LibCxx/include/c++/v1/exception:81: ThirdParty/Linux/LibCxx/include/c++/v1/cstddef:43:15: fatal error: 'stddef.h' file not found #include_next 'stddef.h' ^

In file included from /home/ddname/UnrealEngine/Engine/Intermediate/Build/Linux/B4D820EA/UnrealHeaderTool/Development/Core/SharedPCH.Core.h:39: In file included from /home/ddname/UnrealEngine/Engine/Source/Runtime/Core/Public/CoreSharedPCH.h:7: In file included from Runtime/Core/Public/Misc/Exec.h:6: In file included from Runtime/Core/Public/Misc/AssertionMacros.h:6: In file included from Runtime/Core/Public/HAL/PlatformMisc.h:5: In file included from Runtime/Core/Public/GenericPlatform/GenericPlatformMisc.h:7: In file included from Runtime/Core/Public/HAL/PlatformCrt.h:5: In file included from ThirdParty/Linux/LibCxx/include/c++/v1/new:70: In file included from ThirdParty/Linux/LibCxx/include/c++/v1/exception:81: ThirdParty/Linux/LibCxx/include/c++/v1/cstddef:43:15: fatal error: 'stddef.h' file not found #include_next 'stddef.h' ^

In file included from /home/ddname/UnrealEngine/Engine/Intermediate/Build/Linux/B4D820EA/UnrealHeaderTool/Development/CoreUObject/PCH.CoreUObject.h:42: In file included from /home/ddname/UnrealEngine/Engine/Source/Runtime/CoreUObject/Private/CoreUObjectPrivatePCH.h:6: In file included from Runtime/Core/Public/CoreMinimal.h:26: In file included from Runtime/Core/Public/HAL/PlatformCrt.h:5: In file included from ThirdParty/Linux/LibCxx/include/c++/v1/new:70: In file included from ThirdParty/Linux/LibCxx/include/c++/v1/exception:81: ThirdParty/Linux/LibCxx/include/c++/v1/cstddef:43:15: fatal error: 'stddef.h' file not found #include_next 'stddef.h' ^

In file included from /home/ddname/UnrealEngine/Engine/Intermediate/Build/Linux/B4D820EA/UnrealHeaderTool/Development/UnrealHeaderTool/Module.UnrealHeaderTool.cpp:2: In file included from /home/ddname/UnrealEngine/Engine/Source/Programs/UnrealHeaderTool/Private/BaseParser.cpp:3: In file included from Programs/UnrealHeaderTool/Private/BaseParser.h:5: In file included from Runtime/Core/Public/CoreMinimal.h:26: In file included from Runtime/Core/Public/HAL/PlatformCrt.h:5: In file included from ThirdParty/Linux/LibCxx/include/c++/v1/new:70: In file included from ThirdParty/Linux/LibCxx/include/c++/v1/exception:81: ThirdParty/Linux/LibCxx/include/c++/v1/cstddef:43:15: fatal error: 'stddef.h' file not found #include_next 'stddef.h' ^

1 error generated. 1 error generated. 1 error generated. 1 error generated. ERROR: UBT ERROR: Failed to produce item: /home/ddname/UnrealEngine/Engine/Binaries/Linux/libUnrealHeaderTool-Core.so Total build time: 3.71 seconds (Local executor: 0.00 seconds) Error: UnrealHeaderTool failed for target 'CrashReportClient' (platform: Linux, module info: /home/ddname/UnrealEngine/Engine/Intermediate/Build/Linux/B4D820EA/CrashReportClient/Shipping/CrashReportClient.uhtmanifest, exit code: OtherCompilationError (5)). Makefile:252: recipe for target 'CrashReportClient-Linux-Shipping' failed make: *** [CrashReportClient-Linux-Shipping] Error 5

how to solve this problem?

Product Version: UE 4.17
Tags:
more ▼

asked Sep 05 '17 at 01:58 PM in Bug Reports

avatar image

laoshiheshang
1

(comments are locked)
10|2000 characters needed characters left

0 answers: sort voted first
Be the first one to answer this question
toggle preview:

Up to 5 attachments (including images) can be used with a maximum of 5.2 MB each and 5.2 MB total.

Follow this question

Once you sign in you will be able to subscribe for any updates here

Answers to this question