x

Search in
Sort by:

Question Status:

Search help

  • Simple searches use one or more words. Separate the words with spaces (cat dog) to search cat,dog or both. Separate the words with plus signs (cat +dog) to search for items that may contain cat but must contain dog.
  • You can further refine your search on the search results page, where you can search by keywords, author, topic. These can be combined with each other. Examples
    • cat dog --matches anything with cat,dog or both
    • cat +dog --searches for cat +dog where dog is a mandatory term
    • cat -dog -- searches for cat excluding any result containing dog
    • [cats] —will restrict your search to results with topic named "cats"
    • [cats] [dogs] —will restrict your search to results with both topics, "cats", and "dogs"

Cannot build a shipping build of android product

I keep getting an error when I try to build via shipping on an android game. The log looks like such:

UATHelper: Packaging (Android (ETC2)): Project.Package: PACKAGE COMMAND STARTED UATHelper: Packaging (Android (ETC2)): AndroidPlatform.Package: BaseApkName = C:\CP_P\CP_PF\Binaries/Android\TapNShoot-Android-Shipping.apk UATHelper: Packaging (Android (ETC2)): AndroidPlatform.Package: Creating C:\CP_P\CP_PF\Saved\StagedBuilds\Android_ETC2.obb from C:\CP_P\CP_PF\Saved\StagedBuilds\Android_ETC2 UATHelper: Packaging (Android (ETC2)): <>c_DisplayClass13_0.b0: [1/1] Adding TapNShoot/ to OBB UATHelper: Packaging (Android (ETC2)): <>cDisplayClass13_0.b0: [2/2] Adding TapNShoot/Content/ to OBB UATHelper: Packaging (Android (ETC2)): <>cDisplayClass13_0.b0: [3/3] Adding TapNShoot/Content/Paks/ to OBB UATHelper: Packaging (Android (ETC2)): <>cDisplayClass13_0.b_0: [4/4] Adding TapNShoot/Content/Paks/TapNShoot-Android_ETC2.pak to OBB UATHelper: Packaging (Android (ETC2)): AndroidPlatform.CollectPluginDataPaths: AndroidPlugin: ........\CP_P\CP_PF\Plugins\UniversalMobileAds\Source\UniversalMobileAds\UniversalMobileAds_UPL_Android.xml UATHelper: Packaging (Android (ETC2)): AndroidPlatform.CollectPluginDataPaths: AndroidPlugin: Plugins\Runtime\AndroidPermission\Source\AndroidPermission\AndroidPermission_APL.xml UATHelper: Packaging (Android (ETC2)): AndroidPlatform.CollectPluginDataPaths: AndroidPlugin: Plugins\Runtime\GoogleCloudMessaging\Source\GoogleCloudMessaging\GoogleCloudMessaging_UPL.xml UATHelper: Packaging (Android (ETC2)): AndroidPlatform.CollectPluginDataPaths: AndroidPlugin: Source\Runtime\Online\Voice\AndroidVoiceImpl_UPL.xml UATHelper: Packaging (Android (ETC2)): UnrealPluginLanguage..ctor: UATHelper: Packaging (Android (ETC2)): UPL: Engine../../../../CP_P/CP_PF/Plugins/UniversalMobileAds/Source/UniversalMobileAds/UniversalMobileAds_UPL_Android.xml UATHelper: Packaging (Android (ETC2)): UnrealPluginLanguage..ctor: UATHelper: Packaging (Android (ETC2)): UPL: Engine\Plugins/Runtime/AndroidPermission/Source/AndroidPermission/AndroidPermission_APL.xml UATHelper: Packaging (Android (ETC2)): UnrealPluginLanguage..ctor: UATHelper: Packaging (Android (ETC2)): UPL: Engine\Plugins/Runtime/GoogleCloudMessaging/Source/GoogleCloudMessaging/GoogleCloudMessaging_UPL.xml UATHelper: Packaging (Android (ETC2)): UnrealPluginLanguage..ctor: UATHelper: Packaging (Android (ETC2)): UPL: Engine\Source/Runtime/Online/Voice/AndroidVoiceImpl_UPL.xml UATHelper: Packaging (Android (ETC2)): AndroidPlatform.Package: Target SDK Version25 UATHelper: Packaging (Android (ETC2)): UEDeployAndroid.MakeApk: UATHelper: Packaging (Android (ETC2)): ====10/9/2017 7:25:01 PM====PREPARING TO MAKE APK================================================================= UATHelper: Packaging (Android (ETC2)): Building Java with SDK API level 'android-26' UATHelper: Packaging (Android (ETC2)): Building with Build Tools version '26.0.2' UATHelper: Packaging (Android (ETC2)): UEDeployAndroid.PatchAntBatIfNeeded: UATHelper: Packaging (Android (ETC2)): Patching ant.bat to work around commandline length limit (using unused drive letter Z:) UATHelper: Packaging (Android (ETC2)): Using package name: 'com.GoodWarGames.TapNShoot' UATHelper: Packaging (Android (ETC2)): UEDeployAndroid.WriteJavaOBBDataFile: UATHelper: Packaging (Android (ETC2)): ==== Writing to OBB data file C:\CP_P\CP_PF\Build\Android\src\com\GoodWarGames\TapNShoot\OBBData.java ==== UATHelper: Packaging (Android (ETC2)): UEDeployAndroid.WriteJavaDownloadSupportFiles: UATHelper: Packaging (Android (ETC2)): ==== Writing to shim file C:\CP_P\CP_PF\Build\Android\src\com\epicgames\ue4\DownloadShim.java ==== UATHelper: Packaging (Android (ETC2)): UEDeployAndroid.WriteJavaDownloadSupportFiles: UATHelper: Packaging (Android (ETC2)): ==== Shim data file up to date so not writing. ==== UATHelper: Packaging (Android (ETC2)): UEDeployAndroid.WriteJavaDownloadSupportFiles: UATHelper: Packaging (Android (ETC2)): ==== Writing to template target file C:\CP_P\CP_PF\Build\Android\src\com\GoodWarGames\TapNShoot\AlarmReceiver.java ==== UATHelper: Packaging (Android (ETC2)): UEDeployAndroid.WriteJavaDownloadSupportFiles: UATHelper: Packaging (Android (ETC2)): ==== Template target file up to date so not writing. ==== UATHelper: Packaging (Android (ETC2)): UEDeployAndroid.WriteJavaDownloadSupportFiles: UATHelper: Packaging (Android (ETC2)): ==== Writing to template target file C:\CP_P\CP_PF\Build\Android\src\com\GoodWarGames\TapNShoot\DownloaderActivity.java ==== UATHelper: Packaging (Android (ETC2)): UEDeployAndroid.WriteJavaDownloadSupportFiles: UATHelper: Packaging (Android (ETC2)): ==== Template target file up to date so not writing. ==== UATHelper: Packaging (Android (ETC2)): UEDeployAndroid.WriteJavaDownloadSupportFiles: UATHelper: Packaging (Android (ETC2)): ==== Writing to template target file C:\CP_P\CP_PF\Build\Android\src\com\GoodWarGames\TapNShoot\OBBDownloaderService.java ==== UATHelper: Packaging (Android (ETC2)): UEDeployAndroid.WriteJavaDownloadSupportFiles: UATHelper: Packaging (Android (ETC2)): ==== Template target file up to date so not writing. ==== UATHelper: Packaging (Android (ETC2)): UEDeployAndroid.MakeApk: Cleaning up files based on template dir C:\CP_P\CP_PF\Build\Android\src\com\GoodWarGames\TapNShoot UATHelper: Packaging (Android (ETC2)): UEDeployAndroid.CheckDependencies: C:\CP_P\CP_PF\Binaries\Android\TapNShoot-Android-Shipping-armv7-es2.apk is out of date due to newer input file C:\CP_P\CP_PF\Binaries\Android\TapNShoot-Android-Shipping-armv7-es2.so UATHelper: Packaging (Android (ETC2)): UEDeployAndroid.CheckDependencies: C:\CP_P\CP_PF\Binaries\Android\TapNShoot-Android-Shipping-arm64-es2.apk is out of date due to newer input file C:\CP_P\CP_PF\Binaries\Android\TapNShoot-Android-Shipping-arm64-es2.so UATHelper: Packaging (Android (ETC2)): UnrealPluginLanguage.Init: UPL Init: armeabi-v7a UATHelper: Packaging (Android (ETC2)): UnrealPluginLanguage.ProcessPluginNode: Universal Mobile Ads init UATHelper: Packaging (Android (ETC2)): UnrealPluginLanguage.ProcessPluginNode: Android Permission Plugin Init UATHelper: Packaging (Android (ETC2)): UnrealPluginLanguage.ProcessPluginNode: Google Cloud Messaging init UATHelper: Packaging (Android (ETC2)): UnrealPluginLanguage.ProcessPluginNode: GCMClientSenderID set: false UATHelper: Packaging (Android (ETC2)): UnrealPluginLanguage.ProcessPluginNode: Android Voice init UATHelper: Packaging (Android (ETC2)): UnrealPluginLanguage.Init: UPL Init: arm64-v8a UATHelper: Packaging (Android (ETC2)): UnrealPluginLanguage.ProcessPluginNode: Universal Mobile Ads init UATHelper: Packaging (Android (ETC2)): UnrealPluginLanguage.ProcessPluginNode: Android Permission Plugin Init UATHelper: Packaging (Android (ETC2)): UnrealPluginLanguage.ProcessPluginNode: Google Cloud Messaging init UATHelper: Packaging (Android (ETC2)): UnrealPluginLanguage.ProcessPluginNode: GCMClientSenderID set: false UATHelper: Packaging (Android (ETC2)): UnrealPluginLanguage.ProcessPluginNode: Android Voice init UATHelper: Packaging (Android (ETC2)): UEDeployAndroid.RequiresOBB: On build machine. UATHelper: Packaging (Android (ETC2)): UEDeployAndroid.RequiresOBB: On build machine. UATHelper: Packaging (Android (ETC2)): UEDeployAndroid.GenerateManifest: Fixing minSdkVersion; NDK level above 19 requires minSdkVersion of 21 (arch=arm64) UATHelper: Packaging (Android (ETC2)): UEDeployAndroid.MakeApk: Performing complete package - wiping C:\CP_P\CP_PF\Intermediate/Android/APK, except for predexedLibs UATHelper: Packaging (Android (ETC2)): UEDeployAndroid.MakeApk: bPackageDataInsideApk = False UATHelper: Packaging (Android (ETC2)): AndroidAARHandler.AddRepositories: Added repository: C:\NVPACK\android-sdk-windows\extras\google\m2repository UATHelper: Packaging (Android (ETC2)): AndroidAARHandler.AddRepositories: Added repository: C:\NVPACK\android-sdk-windows\extras\android\m2repository UATHelper: Packaging (Android (ETC2)): AndroidAARHandler.AddRepositories: Added repository: C:\Program Files (x86)\Epic Games\UE_4.17\Engine\Source\ThirdParty\Android\extras\google\m2repository UATHelper: Packaging (Android (ETC2)): AndroidAARHandler.AddRepositories: Added repository: C:\Program Files (x86)\Epic Games\UE_4.17\Engine\Source\ThirdParty\Android\extras\android\m2repository UATHelper: Packaging (Android (ETC2)): UEDeployAndroid.CreateAARHandler: AARImports: com.google.android.gms, play-services-ads, 9.8.0 UATHelper: Packaging (Android (ETC2)): UEDeployAndroid.CreateAARHandler: AARImports: com.google.android.gms, play-services-auth, 9.8.0 UATHelper: Packaging (Android (ETC2)): UEDeployAndroid.CreateAARHandler: AARImports: com.google.android.gms, play-services-games, 9.8.0 UATHelper: Packaging (Android (ETC2)): UEDeployAndroid.CreateAARHandler: AARImports: com.google.android.gms, play-services-nearby, 9.8.0 UATHelper: Packaging (Android (ETC2)): UEDeployAndroid.CreateAARHandler: AARImports: com.google.android.gms, play-services-plus, 9.8.0 UATHelper: Packaging (Android (ETC2)): AndroidAARHandler.AddRepositories: Added repository: Engine........\CP_P\CP_PF\Plugins\UniversalMobileAds\Source\UniversalMobileAds....\Source\ThirdParty\AndroidRepository\m2repository UATHelper: Packaging (Android (ETC2)): UEDeployAndroid.CreateAARHandler: AARImports: com.google.android.gms, play-services-base, 11.0.4 UATHelper: Packaging (Android (ETC2)): AndroidAARHandler.AddNewAAR: AAR: play-services-base: 11.0.4 newer than 9.8.0 UATHelper: Packaging (Android (ETC2)): AndroidAARHandler.AddNewAAR: AAR: play-services-basement: 11.0.4 newer than 9.8.0 UATHelper: Packaging (Android (ETC2)): AndroidAARHandler.AddNewAAR: ERROR: AAR: Unable to find package com.android.support/support-v4! UATHelper: Packaging (Android (ETC2)): AndroidAARHandler.AddNewAAR: AAR: play-services-tasks: 11.0.4 newer than 9.8.0 UATHelper: Packaging (Android (ETC2)): UEDeployAndroid.CreateAARHandler: AARImports: com.google.android.gms, play-services-ads, 11.0.4 UATHelper: Packaging (Android (ETC2)): AndroidAARHandler.AddNewAAR: AAR: play-services-ads: 11.0.4 newer than 9.8.0 UATHelper: Packaging (Android (ETC2)): AndroidAARHandler.AddNewAAR: AAR: play-services-ads-lite: 11.0.4 newer than 9.8.0 UATHelper: Packaging (Android (ETC2)): AndroidAARHandler.AddNewAAR: AAR: play-services-clearcut: 11.0.4 newer than 9.8.0 UATHelper: Packaging (Android (ETC2)): AndroidAARHandler.AddNewAAR: AAR: play-services-gass: 11.0.4 newer than 9.8.0 UATHelper: Packaging (Android (ETC2)): UEDeployAndroid.CreateAARHandler: AARImports: com.google.android.gms, play-services-auth, 11.0.4 UATHelper: Packaging (Android (ETC2)): AndroidAARHandler.AddNewAAR: AAR: play-services-auth: 11.0.4 newer than 9.8.0 UATHelper: Packaging (Android (ETC2)): AndroidAARHandler.AddNewAAR: AAR: play-services-auth-base: 11.0.4 newer than 9.8.0 UATHelper: Packaging (Android (ETC2)): UEDeployAndroid.CreateAARHandler: AARImports: com.google.android.gms, play-services-games, 11.0.4 UATHelper: Packaging (Android (ETC2)): AndroidAARHandler.AddNewAAR: AAR: play-services-games: 11.0.4 newer than 9.8.0 UATHelper: Packaging (Android (ETC2)): AndroidAARHandler.AddNewAAR: AAR: play-services-drive: 11.0.4 newer than 9.8.0 UATHelper: Packaging (Android (ETC2)): UEDeployAndroid.CreateAARHandler: AARImports: com.google.android.gms, play-services-nearby, 11.0.4 UATHelper: Packaging (Android (ETC2)): AndroidAARHandler.AddNewAAR: AAR: play-services-nearby: 11.0.4 newer than 9.8.0 UATHelper: Packaging (Android (ETC2)): UEDeployAndroid.CreateAARHandler: AARImports: com.google.android.gms, play-services-location, 11.0.4 UATHelper: Packaging (Android (ETC2)): UEDeployAndroid.CreateAARHandler: AARImports: com.google.android.gms, play-services-plus, 11.0.4 UATHelper: Packaging (Android (ETC2)): AndroidAARHandler.AddNewAAR: AAR: play-services-plus: 11.0.4 newer than 9.8.0 UATHelper: Packaging (Android (ETC2)): UEDeployAndroid.CreateAARHandler: AARImports: com.android.support, appcompat-v7, 25.3.1 UATHelper: Packaging (Android (ETC2)): AndroidAARHandler.AddNewAAR: ERROR: AAR: Unable to find package com.android.support/appcompat-v7! UATHelper: Packaging (Android (ETC2)): UEDeployAndroid.CreateAARHandler: AARImports: com.android.support, recyclerview-v7, 25.3.1 UATHelper: Packaging (Android (ETC2)): AndroidAARHandler.AddNewAAR: ERROR: AAR: Unable to find package com.android.support/recyclerview-v7! UATHelper: Packaging (Android (ETC2)): UEDeployAndroid.CreateAARHandler: AARImports: com.android.support, support-v13, 25.3.1 UATHelper: Packaging (Android (ETC2)): AndroidAARHandler.AddNewAAR: ERROR: AAR: Unable to find package com.android.support/support-v13! UATHelper: Packaging (Android (ETC2)): UEDeployAndroid.CreateAARHandler: AARImports: com.android.support, support-v4, 25.3.1 UATHelper: Packaging (Android (ETC2)): AndroidAARHandler.AddNewAAR: ERROR: AAR: Unable to find package com.android.support/support-v4! UATHelper: Packaging (Android (ETC2)): UEDeployAndroid.CreateAARHandler: AARImports: com.android.support, support-annotations, 25.3.1 UATHelper: Packaging (Android (ETC2)): AndroidAARHandler.AddNewAAR: ERROR: AAR: Unable to find package com.android.support/support-annotations! UATHelper: Packaging (Android (ETC2)): UEDeployAndroid.CreateAARHandler: AARImports: com.android.support, support-v13, 25.0.0 UATHelper: Packaging (Android (ETC2)): AndroidAARHandler.AddNewAAR: AAR: support-v4: 25.0.0 newer than 24.0.0 UATHelper: Packaging (Android (ETC2)): AndroidAARHandler.AddNewJAR: AAR: support-annotations: 25.0.0 newer than 24.0.0 UATHelper: Packaging (Android (ETC2)): AndroidAARHandler.AddRepositories: Added repository: Engine........\CP_P\CP_PF\Plugins\UniversalMobileAds\Source\UniversalMobileAds....\Source\ThirdParty\AndroidRepository\m2repository UATHelper: Packaging (Android (ETC2)): UEDeployAndroid.CreateAARHandler: AARImports: com.google.android.gms, play-services-base, 11.0.4 UATHelper: Packaging (Android (ETC2)): UEDeployAndroid.CreateAARHandler: AARImports: com.google.android.gms, play-services-ads, 11.0.4 UATHelper: Packaging (Android (ETC2)): UEDeployAndroid.CreateAARHandler: AARImports: com.google.android.gms, play-services-auth, 11.0.4 UATHelper: Packaging (Android (ETC2)): UEDeployAndroid.CreateAARHandler: AARImports: com.google.android.gms, play-services-games, 11.0.4 UATHelper: Packaging (Android (ETC2)): UEDeployAndroid.CreateAARHandler: AARImports: com.google.android.gms, play-services-nearby, 11.0.4 UATHelper: Packaging (Android (ETC2)): UEDeployAndroid.CreateAARHandler: AARImports: com.google.android.gms, play-services-location, 11.0.4 UATHelper: Packaging (Android (ETC2)): UEDeployAndroid.CreateAARHandler: AARImports: com.google.android.gms, play-services-plus, 11.0.4 UATHelper: Packaging (Android (ETC2)): UEDeployAndroid.CreateAARHandler: AARImports: com.android.support, appcompat-v7, 25.3.1 UATHelper: Packaging (Android (ETC2)): AndroidAARHandler.AddNewAAR: ERROR: AAR: Unable to find package com.android.support/appcompat-v7! UATHelper: Packaging (Android (ETC2)): UEDeployAndroid.CreateAARHandler: AARImports: com.android.support, recyclerview-v7, 25.3.1 UATHelper: Packaging (Android (ETC2)): AndroidAARHandler.AddNewAAR: ERROR: AAR: Unable to find package com.android.support/recyclerview-v7! UATHelper: Packaging (Android (ETC2)): UEDeployAndroid.CreateAARHandler: AARImports: com.android.support, support-v13, 25.3.1 UATHelper: Packaging (Android (ETC2)): AndroidAARHandler.AddNewAAR: ERROR: AAR: Unable to find package com.android.support/support-v13! UATHelper: Packaging (Android (ETC2)): UEDeployAndroid.CreateAARHandler: AARImports: com.android.support, support-v4, 25.3.1 UATHelper: Packaging (Android (ETC2)): AndroidAARHandler.AddNewAAR: ERROR: AAR: Unable to find package com.android.support/support-v4! UATHelper: Packaging (Android (ETC2)): UEDeployAndroid.CreateAARHandler: AARImports: com.android.support, support-annotations, 25.3.1 UATHelper: Packaging (Android (ETC2)): AndroidAARHandler.AddNewAAR: ERROR: AAR: Unable to find package com.android.support/support-annotations! UATHelper: Packaging (Android (ETC2)): UEDeployAndroid.CreateAARHandler: AARImports: com.android.support, support-v13, 25.0.0 UATHelper: Packaging (Android (ETC2)): AndroidAARHandler.ExtractAARs: Extracting AARs UATHelper: Packaging (Android (ETC2)): AndroidAARHandler.ExtractAARs: Extracting AAR play-services-base-11.0.4 UATHelper: Packaging (Android (ETC2)): AndroidAARHandler.ExtractAARs: Extracting AAR play-services-basement-11.0.4 UATHelper: Packaging (Android (ETC2)): AndroidAARHandler.ExtractAARs: Extracting AAR play-services-tasks-11.0.4 UATHelper: Packaging (Android (ETC2)): AndroidAARHandler.ExtractAARs: Extracting AAR play-services-ads-11.0.4 UATHelper: Packaging (Android (ETC2)): AndroidAARHandler.ExtractAARs: Extracting AAR play-services-ads-lite-11.0.4 UATHelper: Packaging (Android (ETC2)): AndroidAARHandler.ExtractAARs: Extracting AAR play-services-clearcut-11.0.4 UATHelper: Packaging (Android (ETC2)): AndroidAARHandler.ExtractAARs: Extracting AAR play-services-gass-11.0.4 UATHelper: Packaging (Android (ETC2)): AndroidAARHandler.ExtractAARs: Extracting AAR play-services-safetynet-11.0.4 UATHelper: Packaging (Android (ETC2)): AndroidAARHandler.ExtractAARs: Extracting AAR play-services-auth-11.0.4 UATHelper: Packaging (Android (ETC2)): AndroidAARHandler.ExtractAARs: Extracting AAR play-services-auth-base-11.0.4 UATHelper: Packaging (Android (ETC2)): AndroidAARHandler.ExtractAARs: Extracting AAR play-services-games-11.0.4 UATHelper: Packaging (Android (ETC2)): AndroidAARHandler.ExtractAARs: Extracting AAR play-services-drive-11.0.4 UATHelper: Packaging (Android (ETC2)): AndroidAARHandler.ExtractAARs: Extracting AAR play-services-nearby-11.0.4 UATHelper: Packaging (Android (ETC2)): AndroidAARHandler.ExtractAARs: Extracting AAR play-services-location-11.0.4 UATHelper: Packaging (Android (ETC2)): AndroidAARHandler.ExtractAARs: Extracting AAR play-services-plus-11.0.4 UATHelper: Packaging (Android (ETC2)): AndroidAARHandler.ExtractAARs: Extracting AAR support-v13-25.0.0 UATHelper: Packaging (Android (ETC2)): AndroidAARHandler.UnzipFiles: Changed FileName libs/internal_impl-25.0.0.jar => C:\CP_P\CP_PF\Intermediate\Android\APK\JavaLibs\support-v13-25.0.0\libs\support-v13-25.0.0-internal_impl-25.0.0..jar UATHelper: Packaging (Android (ETC2)): AndroidAARHandler.ExtractAARs: Extracting AAR support-v4-25.0.0 UATHelper: Packaging (Android (ETC2)): AndroidAARHandler.ExtractAARs: Extracting AAR support-compat-25.0.0 UATHelper: Packaging (Android (ETC2)): AndroidAARHandler.UnzipFiles: Changed FileName libs/internal_impl-25.0.0.jar => C:\CP_P\CP_PF\Intermediate\Android\APK\JavaLibs\support-compat-25.0.0\libs\support-compat-25.0.0-internal_impl-25.0.0..jar UATHelper: Packaging (Android (ETC2)): AndroidAARHandler.ExtractAARs: Extracting AAR support-media-compat-25.0.0 UATHelper: Packaging (Android (ETC2)): AndroidAARHandler.UnzipFiles: Changed FileName libs/internal_impl-25.0.0.jar => C:\CP_P\CP_PF\Intermediate\Android\APK\JavaLibs\support-media-compat-25.0.0\libs\support-media-compat-25.0.0-internal_impl-25.0.0..jar UATHelper: Packaging (Android (ETC2)): AndroidAARHandler.ExtractAARs: Extracting AAR support-core-utils-25.0.0 UATHelper: Packaging (Android (ETC2)): AndroidAARHandler.UnzipFiles: Changed FileName libs/internal_impl-25.0.0.jar => C:\CP_P\CP_PF\Intermediate\Android\APK\JavaLibs\support-core-utils-25.0.0\libs\support-core-utils-25.0.0-internal_impl-25.0.0..jar UATHelper: Packaging (Android (ETC2)): AndroidAARHandler.ExtractAARs: Extracting AAR support-core-ui-25.0.0 UATHelper: Packaging (Android (ETC2)): AndroidAARHandler.UnzipFiles: Changed FileName libs/internal_impl-25.0.0.jar => C:\CP_P\CP_PF\Intermediate\Android\APK\JavaLibs\support-core-ui-25.0.0\libs\support-core-ui-25.0.0-internal_impl-25.0.0..jar UATHelper: Packaging (Android (ETC2)): AndroidAARHandler.ExtractAARs: Extracting AAR support-fragment-25.0.0 UATHelper: Packaging (Android (ETC2)): AndroidAARHandler.UnzipFiles: Changed FileName libs/internal_impl-25.0.0.jar => C:\CP_P\CP_PF\Intermediate\Android\APK\JavaLibs\support-fragment-25.0.0\libs\support-fragment-25.0.0-internal_impl-25.0.0..jar UATHelper: Packaging (Android (ETC2)): AndroidAARHandler.CopyJARs: Copying JAR support-annotations-25.0.0.jar UATHelper: Packaging (Android (ETC2)): UEDeployAndroid.ValidateGooglePlay: WARNING: UATHelper: Packaging (Android (ETC2)): WARNING: GooglePlay Games App ID is invalid! Replacing it with "1" UATHelper: Packaging (Android (ETC2)): UEDeployAndroid.MakeApk: UATHelper: Packaging (Android (ETC2)): ====10/9/2017 7:25:06 PM====PREPARING NATIVE CODE================================================================= UATHelper: Packaging (Android (ETC2)): UEDeployAndroid.RequiresOBB: On build machine. UATHelper: Packaging (Android (ETC2)): UnrealPluginLanguage.ProcessPluginNode: Copying permission_library directory to staging before build UATHelper: Packaging (Android (ETC2)): UnrealPluginLanguage.ProcessPluginNode: UATHelper: Packaging (Android (ETC2)): Directory C:\Program Files (x86)\Epic Games\UE_4.17/Engine/Source/ThirdParty/AndroidPermission/permission_library copied to C:\CP_P\CP_PF\Intermediate/Android/APK/JavaLibs/permission_library UATHelper: Packaging (Android (ETC2)): UEDeployAndroid.UpdateProjectProperties: UATHelper: Packaging (Android (ETC2)): ====10/9/2017 7:25:06 PM====UPDATING BUILD CONFIGURATION FILES==================================================== UATHelper: Packaging (Android (ETC2)): UEDeployAndroid.RunCommandLineProgramWithException: Updating project.properties, local.properties, and build.xml for downloader_library... UATHelper: Packaging (Android (ETC2)): UEDeployAndroid.RunCommandLineProgramWithException: Updating project.properties, local.properties, and build.xml for permission_library... UATHelper: Packaging (Android (ETC2)): UEDeployAndroid.RunCommandLineProgramWithException: Updating project.properties, local.properties, and build.xml for play-services-ads-11.0.4... UATHelper: Packaging (Android (ETC2)): UEDeployAndroid.RunCommandLineProgramWithException: Updating project.properties, local.properties, and build.xml for play-services-ads-lite-11.0.4... UATHelper: Packaging (Android (ETC2)): UEDeployAndroid.RunCommandLineProgramWithException: Updating project.properties, local.properties, and build.xml for play-services-auth-11.0.4... UATHelper: Packaging (Android (ETC2)): UEDeployAndroid.RunCommandLineProgramWithException: Updating project.properties, local.properties, and build.xml for play-services-auth-base-11.0.4... UATHelper: Packaging (Android (ETC2)): UEDeployAndroid.RunCommandLineProgramWithException: Updating project.properties, local.properties, and build.xml for play-services-base-11.0.4... UATHelper: Packaging (Android (ETC2)): UEDeployAndroid.RunCommandLineProgramWithException: Updating project.properties, local.properties, and build.xml for play-services-basement-11.0.4... UATHelper: Packaging (Android (ETC2)): UEDeployAndroid.RunCommandLineProgramWithException: Updating project.properties, local.properties, and build.xml for play-services-clearcut-11.0.4... UATHelper: Packaging (Android (ETC2)): UEDeployAndroid.RunCommandLineProgramWithException: Updating project.properties, local.properties, and build.xml for play-services-drive-11.0.4... UATHelper: Packaging (Android (ETC2)): UEDeployAndroid.RunCommandLineProgramWithException: Updating project.properties, local.properties, and build.xml for play-services-games-11.0.4... UATHelper: Packaging (Android (ETC2)): UEDeployAndroid.RunCommandLineProgramWithException: Updating project.properties, local.properties, and build.xml for play-services-gass-11.0.4... UATHelper: Packaging (Android (ETC2)): UEDeployAndroid.RunCommandLineProgramWithException: Updating project.properties, local.properties, and build.xml for play-services-location-11.0.4... UATHelper: Packaging (Android (ETC2)): UEDeployAndroid.RunCommandLineProgramWithException: Updating project.properties, local.properties, and build.xml for play-services-nearby-11.0.4... UATHelper: Packaging (Android (ETC2)): UEDeployAndroid.RunCommandLineProgramWithException: Updating project.properties, local.properties, and build.xml for play-services-plus-11.0.4... UATHelper: Packaging (Android (ETC2)): UEDeployAndroid.RunCommandLineProgramWithException: Updating project.properties, local.properties, and build.xml for play-services-safetynet-11.0.4... UATHelper: Packaging (Android (ETC2)): UEDeployAndroid.RunCommandLineProgramWithException: Updating project.properties, local.properties, and build.xml for play-services-tasks-11.0.4... UATHelper: Packaging (Android (ETC2)): UEDeployAndroid.RunCommandLineProgramWithException: Updating project.properties, local.properties, and build.xml for support-compat-25.0.0... UATHelper: Packaging (Android (ETC2)): UEDeployAndroid.RunCommandLineProgramWithException: Updating project.properties, local.properties, and build.xml for support-core-ui-25.0.0... UATHelper: Packaging (Android (ETC2)): UEDeployAndroid.RunCommandLineProgramWithException: Updating project.properties, local.properties, and build.xml for support-core-utils-25.0.0... UATHelper: Packaging (Android (ETC2)): UEDeployAndroid.RunCommandLineProgramWithException: Updating project.properties, local.properties, and build.xml for support-fragment-25.0.0... UATHelper: Packaging (Android (ETC2)): UEDeployAndroid.RunCommandLineProgramWithException: Updating project.properties, local.properties, and build.xml for support-media-compat-25.0.0... UATHelper: Packaging (Android (ETC2)): UEDeployAndroid.RunCommandLineProgramWithException: Updating project.properties, local.properties, and build.xml for support-v13-25.0.0... UATHelper: Packaging (Android (ETC2)): UEDeployAndroid.RunCommandLineProgramWithException: Updating project.properties, local.properties, and build.xml for support-v4-25.0.0... UATHelper: Packaging (Android (ETC2)): UEDeployAndroid.UpdateGameActivity: UATHelper: Packaging (Android (ETC2)): ==== Writing new GameActivity.java file to C:\CP_P\CP_PF\Intermediate/Android/APK\src\com\epicgames\ue4\GameActivity.java ==== UATHelper: Packaging (Android (ETC2)): UEDeployAndroid.MakeApk: UATHelper: Packaging (Android (ETC2)): Copying new .so C:\CP_P\CP_PF\Binaries\Android\TapNShoot-Android-Shipping-armv7-es2.so file to jni folder... UATHelper: Packaging (Android (ETC2)): UEDeployAndroid.RunCommandLineProgramWithException: Preparing native code for debugging... UATHelper: Packaging (Android (ETC2)): UEDeployAndroid.MakeApk: UATHelper: Packaging (Android (ETC2)): ====10/9/2017 7:26:00 PM====PERFORMING FINAL APK PACKAGE OPERATION================================================ UATHelper: Packaging (Android (ETC2)): UEDeployAndroid.RunCommandLineProgramAndReturnResult: Making .apk with Ant... (note: it's safe to ignore javac obsolete warnings) UATHelper: Packaging (Android (ETC2)): BUILD FAILED UATHelper: Packaging (Android (ETC2)): C:\NVPACK\android-sdk-windows\tools\ant\build.xml:573: ../support-v13-25.3.1 resolve to a path with no project.properties file for project Z:\JavaLibs\permission_library UATHelper: Packaging (Android (ETC2)): Total time: 1 second UATHelper: Packaging (Android (ETC2)): UEDeployAndroid.RunCommandLineProgramWithException: Making .apk with Ant again to show errors UATHelper: Packaging (Android (ETC2)): Buildfile: Z:\build.xml UATHelper: Packaging (Android (ETC2)): [getbuildtools] Using latest Build Tools: 26.0.2 UATHelper: Packaging (Android (ETC2)): -set-mode-check: UATHelper: Packaging (Android (ETC2)): -set-release-mode: UATHelper: Packaging (Android (ETC2)): -release-obfuscation-check: UATHelper: Packaging (Android (ETC2)): [echo] proguard.config is C:\NVPACK\android-sdk-windows/tools/proguard/proguard-android.txt:proguard-project.txt UATHelper: Packaging (Android (ETC2)): [echo] Proguard.config is enabled UATHelper: Packaging (Android (ETC2)): -pre-build: UATHelper: Packaging (Android (ETC2)): -check-env: UATHelper: Packaging (Android (ETC2)): [checkenv] Android SDK Tools Revision 25.2.5 UATHelper: Packaging (Android (ETC2)): [checkenv] Installed at C:\NVPACK\android-sdk-windows UATHelper: Packaging (Android (ETC2)): -setup: UATHelper: Packaging (Android (ETC2)): [echo] Project Name: TapNShoot UATHelper: Packaging (Android (ETC2)): [gettype] Project Type: Application UATHelper: Packaging (Android (ETC2)): -build-setup: UATHelper: Packaging (Android (ETC2)): [getbuildtools] Using latest Build Tools: 26.0.2 UATHelper: Packaging (Android (ETC2)): [echo] Resolving Build Target for TapNShoot... UATHelper: Packaging (Android (ETC2)): [gettarget] Project Target: Android 8.0.0 UATHelper: Packaging (Android (ETC2)): [gettarget] API level: 26 UATHelper: Packaging (Android (ETC2)): [echo] ---------- UATHelper: Packaging (Android (ETC2)): [echo] Creating output directories if needed... UATHelper: Packaging (Android (ETC2)): [echo] ---------- UATHelper: Packaging (Android (ETC2)): [echo] Resolving Dependencies for TapNShoot... UATHelper: Packaging (Android (ETC2)): BUILD FAILED UATHelper: Packaging (Android (ETC2)): C:\NVPACK\android-sdk-windows\tools\ant\build.xml:573: ../support-v13-25.3.1 resolve to a path with no project.properties file for project Z:\JavaLibs\permission_library UATHelper: Packaging (Android (ETC2)): Total time: 1 second UATHelper: Packaging (Android (ETC2)): Program.Main: ERROR: AutomationTool terminated with exception: ERROR: cmd.exe failed with args /c "C:\NVPACK\apache-ant-1.8.2/bin/ant.bat" release -Djava.source=1.7 -Djava.target=1.7 UATHelper: Packaging (Android (ETC2)): Program.Main: AutomationTool exiting with ExitCode=1 (Error_Unknown) UATHelper: Packaging (Android (ETC2)): BUILD FAILED PackagingResults: Error: Unknown Error

Product Version: UE 4.17
Tags:
more ▼

asked Oct 10 '17 at 12:59 PM in Packaging & Deployment

avatar image

Demoneyejin
95 11 16 26

(comments are locked)
10|2000 characters needed characters left
Viewable by all users

1 answer: sort voted first

I was able to resolve this by downloading all the different build tools available from the android.bat stuff AND re-creating the keystore. I also had to download the latest proguard and place it in the right place. I also had to make sure that NVPACK was correctly targeted and I set the latest SDK to matchndk.

more ▼

answered Oct 10 '17 at 02:13 PM

avatar image

Demoneyejin
95 11 16 26

(comments are locked)
10|2000 characters needed characters left
Viewable by all users
Your answer
toggle preview:

Up to 5 attachments (including images) can be used with a maximum of 5.2 MB each and 5.2 MB total.

Follow this question

Once you sign in you will be able to subscribe for any updates here

Answers to this question