x

Search in
Sort by:

Question Status:

Search help

  • Simple searches use one or more words. Separate the words with spaces (cat dog) to search cat,dog or both. Separate the words with plus signs (cat +dog) to search for items that may contain cat but must contain dog.
  • You can further refine your search on the search results page, where you can search by keywords, author, topic. These can be combined with each other. Examples
    • cat dog --matches anything with cat,dog or both
    • cat +dog --searches for cat +dog where dog is a mandatory term
    • cat -dog -- searches for cat excluding any result containing dog
    • [cats] —will restrict your search to results with topic named "cats"
    • [cats] [dogs] —will restrict your search to results with both topics, "cats", and "dogs"

someone know about this package error?

i just start packing and bummm this happens don't know why :/

UATHelper: Packaging (Windows (64-bit)): Running AutomationTool... UATHelper: Packaging (Windows (64-bit)): Automation.ParseCommandLine: Parsing command line: -ScriptsForProject="D:/UNREAL/MONACO/APTO 4.17/APTO.uproject" BuildCookRun -nocompile -nocompileeditor -installed -nop4 -project="D:/UNREAL/MONACO/APTO 4.17/APTO.uproject" -cook -stage -archive -archivedirectory=D:/PROYECTOR -package -clientconfig=Development -ue4exe= UE4Editor-Cmd.exe -pak -prereqs -nodebuginfo -targetplatform=Win64 -build -utf8output UATHelper: Packaging (Windows (64-bit)): BuildCookRun.SetupParams: Setting up ProjectParams for D:\UNREAL\MONACO\APTO 4.17\APTO.uproject UATHelper: Packaging (Windows (64-bit)): Project.Build: BUILD COMMAND STARTED UATHelper: Packaging (Windows (64-bit)): CommandUtils.Run: Run: C:\Program Files\Epic Games\UE_4.17\Engine\Binaries\DotNET\UnrealBuildTool.exe APTO Win64 Development -Project="D:\UNREAL\MONACO\APTO 4.17\APTO.uproject" "D:\UNREAL\MONACO\APTO 4.17\APTO.uproject" -NoUBTMakefiles -remoteini="D:\UNREAL\MONACO\APTO 4.17" -skipdeploy -noxge -generatemanifest -NoH otReload UATHelper: Packaging (Windows (64-bit)): CommandUtils.Run: Run: Took 1,6020255s to run UnrealBuildTool.exe, ExitCode=0 UATHelper: Packaging (Windows (64-bit)): CommandUtils.Run: Run: C:\Program Files\Epic Games\UE_4.17\Engine\Binaries\DotNET\UnrealBuildTool.exe APTO Win64 Development -Project="D:\UNREAL\MONACO\APTO 4.17\APTO.uproject" "D:\UNREAL\MONACO\APTO 4.17\APTO.uproject" -NoUBTMakefiles -remoteini="D:\UNREAL\MONACO\APTO 4.17" -skipdeploy -noxge -NoHotReload -ignoreju nk UATHelper: Packaging (Windows (64-bit)): UnrealBuildTool: Performing 1 actions (4 in parallel) UATHelper: Packaging (Windows (64-bit)): UnrealBuildTool: [1/1] Link APTO.exe UATHelper: Packaging (Windows (64-bit)): UnrealBuildTool: LINK : fatal error LNK1181: no se puede abrir el archivo de entrada 'C:\Program Files\Epic Games\UE_4.17\Engine\Plugins\AllrightRig\Binaries\Win64\UE4-ARigRuntime.lib' UATHelper: Packaging (Windows (64-bit)): UnrealBuildTool: ERROR: UBT ERROR: Failed to produce item: D:\UNREAL\MONACO\APTO 4.17\Binaries\Win64\APTO.exe UATHelper: Packaging (Windows (64-bit)): UnrealBuildTool: Total build time: 5,33 seconds (Local executor: 0,00 seconds) UATHelper: Packaging (Windows (64-bit)): CommandUtils.Run: Run: Took 5,5933249s to run UnrealBuildTool.exe, ExitCode=5 UATHelper: Packaging (Windows (64-bit)): Program.Main: ERROR: AutomationTool terminated with exception: AutomationTool.CommandUtils+CommandFailedException: Command failed (Result:5): C:\Program Files\Epic Games\UE_4.17\Engine\Binaries\DotNET\UnrealBuildTool.exe APTO Win64 Development -Project="D:\UNREAL\MONACO\APTO 4.17\APTO.uproject" "D:\UNREAL\MONACO\APTO 4.17\APTO.uproject" -NoUBTMakefiles -remoteini="D:\UNREAL\MONACO\APTO 4.17" -skipdeploy -noxge -NoHotReload -ignorejunk. See logfile for details: 'UnrealBuildTool-2018.02.23-09.24.33.txt' UATHelper: Packaging (Windows (64-bit)): en AutomationTool.CommandUtils.RunAndLog(String App, String CommandLine, String Logfile, Int32 MaxSuccessCode, String Input, ERunOptions Options, Dictionary`2 EnvVars, SpewFilterCallbackType SpewFilterCallback) UATHelper: Packaging (Windows (64-bit)): en AutomationTool.CommandUtils.RunAndLog(CommandEnvironment Env, String App, String CommandLine, String LogName, Int32 MaxSuccessCode, String Input, ERunOptions Options, Dictionary`2 EnvVars, SpewFilterCallbackType SpewFilterCallback) UATHelper: Packaging (Windows (64-bit)): en AutomationTool.CommandUtils.RunUBT(CommandEnvironment Env, String UBTExecutable, String CommandLine, String LogName, Dictionary`2 EnvVars) UATHelper: Packaging (Windows (64-bit)): en AutomationTool.CommandUtils.RunUBT(CommandEnvironment Env, String UBTExecutable, FileReference Project, String Target, String Platform, String Config, String AdditionalArgs, String LogName, Dictionary`2 EnvVars) UATHelper: Packaging (Windows (64-bit)): en AutomationTool.UE4Build.BuildWithUBT(String TargetName, UnrealTargetPlatform TargetPlatform, String Config, FileReference UprojectPath, Boolean ForceMonolithic, Boolean ForceNonUnity, Boolean ForceDebugInfo, Boolean ForceFlushMac, Boolean DisableXGE, String InAddArgs, Boolean ForceUnity, Dictionary`2 EnvVars) UATHelper: Packaging (Windows (64-bit)): en AutomationTool.UE4Build.Build(BuildAgenda Agenda, Nullable`1 InDeleteBuildProducts, Boolean InUpdateVersionFiles, Boolean InForceNoXGE, Boolean InUseParallelExecutor, Boolean InForceNonUnity, Boolean InForceUnity, Boolean InShowProgress, Dictionary`2 PlatformEnvVars, Nullable`1 InChangelistNumberOverride, Dictio nary`2 InTargetToManifest) UATHelper: Packaging (Windows (64-bit)): en Project.Build(BuildCommand Command, ProjectParams Params, Int32 WorkingCL, ProjectBuildTargets TargetMask) UATHelper: Packaging (Windows (64-bit)): en BuildCookRun.DoBuildCookRun(ProjectParams Params) UATHelper: Packaging (Windows (64-bit)): en BuildCookRun.ExecuteBuild() UATHelper: Packaging (Windows (64-bit)): en AutomationTool.BuildCommand.Execute() UATHelper: Packaging (Windows (64-bit)): en AutomationTool.Automation.Execute(List`1 CommandsToExecute, Dictionary`2 Commands) UATHelper: Packaging (Windows (64-bit)): en AutomationTool.Automation.Process(String[] Arguments) UATHelper: Packaging (Windows (64-bit)): en AutomationTool.Program.MainProc(Object Param) UATHelper: Packaging (Windows (64-bit)): en AutomationTool.InternalUtils.RunSingleInstance(Func`2 Main, Object Param) UATHelper: Packaging (Windows (64-bit)): en AutomationTool.Program.Main() UATHelper: Packaging (Windows (64-bit)): Program.Main: AutomationTool exiting with ExitCode=5 (5) UATHelper: Packaging (Windows (64-bit)): BUILD FAILED PackagingResults: Error: Unknown Error

Product Version: UE 4.17
Tags:
more ▼

asked Feb 23 '18 at 02:27 PM in Using UE4

avatar image

andresmedia
6 1 3 4

(comments are locked)
10|2000 characters needed characters left

0 answers: sort voted first
Be the first one to answer this question
toggle preview:

Up to 5 attachments (including images) can be used with a maximum of 5.2 MB each and 5.2 MB total.

Follow this question

Once you sign in you will be able to subscribe for any updates here

Answers to this question