x

Search in
Sort by:

Question Status:

Search help

  • Simple searches use one or more words. Separate the words with spaces (cat dog) to search cat,dog or both. Separate the words with plus signs (cat +dog) to search for items that may contain cat but must contain dog.
  • You can further refine your search on the search results page, where you can search by keywords, author, topic. These can be combined with each other. Examples
    • cat dog --matches anything with cat,dog or both
    • cat +dog --searches for cat +dog where dog is a mandatory term
    • cat -dog -- searches for cat excluding any result containing dog
    • [cats] —will restrict your search to results with topic named "cats"
    • [cats] [dogs] —will restrict your search to results with both topics, "cats", and "dogs"

cannot compile shipping linux since 4.19

all same results in front end, in editor and vs for source 4.19 project shipping compile help!

 LogPlatformFile: Not using cached read wrapper
 LogInit: Display: RandInit(-624938781) SRandInit(-624938781).
 LogInit: Read version file with build ID '16713607-7dbc-47bf-bdbe-64fe355ce7df'
 LogInit: Registered custom module enumerator with build ID '16713607-7dbc-47bf-bdbe-64fe355ce7df'
 LogTaskGraph: Started task graph with 5 named threads and 14 total threads with 3 sets of task threads.
 LogStats: Stats thread started at 4.043185
 LogD3D11RHI: Aftermath initialized
 LogICUInternationalization: Display: ICU TimeZone Detection - Raw Offset: -5:00, Platform Override: ''
 LogPluginManager: Warning: Engine version string in ../../../../../Unreal Projects/Ultraball/Plugins/Marketplace/CommandLineParametersPlugin-master/CommandLineParametersPlugin.uplugin could not be parsed ("1579795")
 LogPluginManager: Mounting plugin Paper2D
 LogPluginManager: Mounting plugin LiveLink
 LogPluginManager: Mounting plugin LightPropagationVolume
 LogPluginManager: Mounting plugin CLionSourceCodeAccess
 LogPluginManager: Mounting plugin CodeLiteSourceCodeAccess
 LogPluginManager: Mounting plugin GitSourceControl
 LogPluginManager: Mounting plugin KDevelopSourceCodeAccess
 LogPluginManager: Mounting plugin NullSourceCodeAccess
 LogPluginManager: Mounting plugin PerforceSourceControl
 LogPluginManager: Mounting plugin SubversionSourceControl
 LogPluginManager: Mounting plugin UObjectPlugin
 LogPluginManager: Mounting plugin VisualStudioCodeSourceCodeAccess
 LogPluginManager: Mounting plugin VisualStudioSourceCodeAccess
 LogPluginManager: Mounting plugin XCodeSourceCodeAccess
 LogPluginManager: Mounting plugin AssetManagerEditor
 LogPluginManager: Mounting plugin CryptoKeys
 LogPluginManager: Mounting plugin DataValidation
 LogPluginManager: Mounting plugin FacialAnimation
 LogPluginManager: Mounting plugin GameplayTagsEditor
 LogPluginManager: Mounting plugin MobileLauncherProfileWizard
 LogPluginManager: Mounting plugin PluginBrowser
 LogPluginManager: Mounting plugin SpeedTreeImporter
 LogPluginManager: Mounting plugin DatasmithContent
 LogPluginManager: Mounting plugin AlembicImporter
 LogPluginManager: Mounting plugin CharacterAI
 LogPluginManager: Mounting plugin HTML5Networking
 LogPluginManager: Mounting plugin AvfMedia
 LogPluginManager: Mounting plugin ImgMedia
 LogPluginManager: Mounting plugin LinearTimecode
 LogPluginManager: Mounting plugin MediaCompositing
 LogPluginManager: Mounting plugin MediaPlayerEditor
 LogPluginManager: Mounting plugin WmfMedia
 LogPluginManager: Mounting plugin TcpMessaging
 LogPluginManager: Mounting plugin UdpMessaging
 LogPluginManager: Mounting plugin ActorSequence
 LogPluginManager: Mounting plugin LevelSequenceEditor
 LogPluginManager: Mounting plugin MatineeToLevelSequence
 LogPluginManager: Mounting plugin NetcodeUnitTest
 LogPluginManager: Mounting plugin NUTUnrealEngine4
 LogPluginManager: Mounting plugin OnlineFramework
 LogPluginManager: Mounting plugin OnlineSubsystem
 LogPluginManager: Mounting plugin OnlineSubsystemNull
 LogPluginManager: Mounting plugin OnlineSubsystemSteam
 LogPluginManager: Mounting plugin OnlineSubsystemUtils
 LogPluginManager: Mounting plugin AndroidMoviePlayer
 LogPluginManager: Mounting plugin AppleARKit
 LogPluginManager: Mounting plugin AppleMoviePlayer
 LogPluginManager: Mounting plugin ArchVisCharacter
 LogPluginManager: Mounting plugin AudioCapture
 LogPluginManager: Mounting plugin CableComponent
 LogPluginManager: Mounting plugin CustomMeshComponent
 LogPluginManager: Mounting plugin ExampleDeviceProfileSelector
 LogPluginManager: Mounting plugin GoogleCloudMessaging
 LogPluginManager: Mounting plugin ImmediatePhysics
 LogPluginManager: Mounting plugin LinuxDeviceProfileSelector
 LogPluginManager: Mounting plugin MobilePatchingUtils
 LogPluginManager: Mounting plugin OculusVR
 LogPluginManager: Plugin shader directory ../../../Engine/Plugins/Runtime/Oculus/OculusVR/Shaders found
 LogPluginManager: Mapping shader source directory ../../../Engine/Plugins/Runtime/Oculus/OculusVR/Shaders to virtual directory /Plugin/OculusVR
 LogPluginManager: Mounting plugin PhysXVehicles
 LogPluginManager: Mounting plugin ProceduralMeshComponent
 LogPluginManager: Mounting plugin RuntimePhysXCooking
 LogPluginManager: Mounting plugin WebBrowserWidget
 LogPluginManager: Mounting plugin WindowsMoviePlayer
 LogPluginManager: Mounting plugin CommandLineParametersPlugin
 LogPluginManager: Mounting plugin VaRestPlugin
 LogStreaming: Display: Took  0.953s to configure plugins.
 LogModuleManager: Display: Found up-to-date module file ../../../../../Unreal Projects/Ultraball/Binaries/Win64/UE4Editor-Ultraball.dll (API version 0).
 LogModuleManager: Display: Found up-to-date module file ../../../Engine/Plugins/2D/Paper2D/Binaries/Win64/UE4Editor-Paper2D.dll (API version 0).
 LogModuleManager: Display: Found up-to-date module file ../../../Engine/Plugins/2D/Paper2D/Binaries/Win64/UE4Editor-Paper2DEditor.dll (API version 0).
 LogModuleManager: Display: Found up-to-date module file ../../../Engine/Plugins/2D/Paper2D/Binaries/Win64/UE4Editor-PaperSpriteSheetImporter.dll (API version 0).
 LogModuleManager: Display: Found up-to-date module file ../../../Engine/Plugins/2D/Paper2D/Binaries/Win64/UE4Editor-PaperTiledImporter.dll (API version 0).
 LogModuleManager: Display: Found up-to-date module file ../../../Engine/Plugins/2D/Paper2D/Binaries/Win64/UE4Editor-SmartSnapping.dll (API version 0).
 LogModuleManager: Display: Found up-to-date module file ../../../Engine/Plugins/Animation/LiveLink/Binaries/Win64/UE4Editor-LiveLink.dll (API version 0).
 LogModuleManager: Display: Found up-to-date module file ../../../Engine/Plugins/Animation/LiveLink/Binaries/Win64/UE4Editor-LiveLinkEditor.dll (API version 0).
 LogModuleManager: Display: Found up-to-date module file ../../../Engine/Plugins/Blendables/LightPropagationVolume/Binaries/Win64/UE4Editor-LightPropagationVolumeRuntime.dll (API version 0).
 LogModuleManager: Display: Found up-to-date module file ../../../Engine/Plugins/Blendables/LightPropagationVolume/Binaries/Win64/UE4Editor-LightPropagationVolumeEditor.dll (API version 0).
 LogModuleManager: Display: Found up-to-date module file ../../../Engine/Plugins/Developer/CLionSourceCodeAccess/Binaries/Win64/UE4Editor-CLionSourceCodeAccess.dll (API version 0).
 LogModuleManager: Display: Found up-to-date module file ../../../Engine/Plugins/Developer/GitSourceControl/Binaries/Win64/UE4Editor-GitSourceControl.dll (API version 0).
 LogModuleManager: Display: Found up-to-date module file ../../../Engine/Plugins/Developer/PerforceSourceControl/Binaries/Win64/UE4Editor-PerforceSourceControl.dll (API version 0).
 LogModuleManager: Display: Found up-to-date module file ../../../Engine/Plugins/Developer/SubversionSourceControl/Binaries/Win64/UE4Editor-SubversionSourceControl.dll (API version 0).
 LogModuleManager: Display: Found up-to-date module file ../../../Engine/Plugins/Developer/UObjectPlugin/Binaries/Win64/UE4Editor-UObjectPlugin.dll (API version 0).
 LogModuleManager: Display: Found up-to-date module file ../../../Engine/Plugins/Developer/VisualStudioCodeSourceCodeAccess/Binaries/Win64/UE4Editor-VisualStudioCodeSourceCodeAccess.dll (API version 0).
 LogModuleManager: Display: Found up-to-date module file ../../../Engine/Plugins/Developer/VisualStudioSourceCodeAccess/Binaries/Win64/UE4Editor-VisualStudioSourceCodeAccess.dll (API version 0).
 LogModuleManager: Display: Found up-to-date module file ../../../Engine/Plugins/Editor/AssetManagerEditor/Binaries/Win64/UE4Editor-AssetManagerEditor.dll (API version 0).
 LogModuleManager: Display: Found up-to-date module file ../../../Engine/Plugins/Editor/CryptoKeys/Binaries/Win64/UE4Editor-CryptoKeys.dll (API version 0).
 LogModuleManager: Display: Found up-to-date module file ../../../Engine/Plugins/Editor/CryptoKeys/Binaries/Win64/UE4Editor-CryptoKeysOpenSSL.dll (API version 0).
 LogModuleManager: Display: Found up-to-date module file ../../../Engine/Plugins/Editor/DataValidation/Binaries/Win64/UE4Editor-DataValidation.dll (API version 0).
 LogModuleManager: Display: Found up-to-date module file ../../../Engine/Plugins/Editor/FacialAnimation/Binaries/Win64/UE4Editor-FacialAnimation.dll (API version 0).
 LogModuleManager: Display: Found up-to-date module file ../../../Engine/Plugins/Editor/FacialAnimation/Binaries/Win64/UE4Editor-FacialAnimationEditor.dll (API version 0).
 LogModuleManager: Display: Found up-to-date module file ../../../Engine/Plugins/Editor/GameplayTagsEditor/Binaries/Win64/UE4Editor-GameplayTagsEditor.dll (API version 0).
 LogModuleManager: Display: Found up-to-date module file ../../../Engine/Plugins/Editor/MobileLauncherProfileWizard/Binaries/Win64/UE4Editor-MobileLauncherProfileWizard.dll (API version 0).
 LogModuleManager: Display: Found up-to-date module file ../../../Engine/Plugins/Editor/PluginBrowser/Binaries/Win64/UE4Editor-PluginBrowser.dll (API version 0).
 LogModuleManager: Display: Found up-to-date module file ../../../Engine/Plugins/Editor/SpeedTreeImporter/Binaries/Win64/UE4Editor-SpeedTreeImporter.dll (API version 0).
 LogModuleManager: Display: Found up-to-date module file ../../../Engine/Plugins/Enterprise/DatasmithContent/Binaries/Win64/UE4Editor-DatasmithContent.dll (API version 0).
 LogModuleManager: Display: Found up-to-date module file ../../../Engine/Plugins/Experimental/AlembicImporter/Binaries/Win64/UE4Editor-AlembicImporter.dll (API version 0).
 LogModuleManager: Display: Found up-to-date module file ../../../Engine/Plugins/Experimental/AlembicImporter/Binaries/Win64/UE4Editor-AlembicLibrary.dll (API version 0).
 LogModuleManager: Display: Found up-to-date module file ../../../Engine/Plugins/Experimental/CharacterAI/Binaries/Win64/UE4Editor-CharacterAI.dll (API version 0).
 LogModuleManager: Display: Found up-to-date module file ../../../Engine/Plugins/Experimental/HTML5Networking/Binaries/Win64/UE4Editor-HTML5Networking.dll (API version 0).
 LogModuleManager: Display: Found up-to-date module file ../../../Engine/Plugins/Media/AvfMedia/Binaries/Win64/UE4Editor-AvfMediaEditor.dll (API version 0).
 LogModuleManager: Display: Found up-to-date module file ../../../Engine/Plugins/Media/AvfMedia/Binaries/Win64/UE4Editor-AvfMediaFactory.dll (API version 0).
 LogModuleManager: Display: Found up-to-date module file ../../../Engine/Plugins/Media/AvfMedia/Binaries/Win64/UE4Editor-AvfMediaFactory.dll (API version 0).
 LogModuleManager: Display: Found up-to-date module file ../../../Engine/Plugins/Media/ImgMedia/Binaries/Win64/UE4Editor-ImgMedia.dll (API version 0).
 LogModuleManager: Display: Found up-to-date module file ../../../Engine/Plugins/Media/ImgMedia/Binaries/Win64/UE4Editor-ImgMediaEditor.dll (API version 0).
 LogModuleManager: Display: Found up-to-date module file ../../../Engine/Plugins/Media/ImgMedia/Binaries/Win64/UE4Editor-ImgMediaFactory.dll (API version 0).
 LogModuleManager: Display: Found up-to-date module file ../../../Engine/Plugins/Media/ImgMedia/Binaries/Win64/UE4Editor-ImgMediaFactory.dll (API version 0).
 LogModuleManager: Display: Found up-to-date module file ../../../Engine/Plugins/Media/ImgMedia/Binaries/Win64/UE4Editor-OpenExrWrapper.dll (API version 0).
 LogModuleManager: Display: Found up-to-date module file ../../../Engine/Plugins/Media/LinearTimecode/Binaries/Win64/UE4Editor-LinearTimecode.dll (API version 0).
 LogModuleManager: Display: Found up-to-date module file ../../../Engine/Plugins/Media/MediaCompositing/Binaries/Win64/UE4Editor-MediaCompositing.dll (API version 0).
 LogModuleManager: Display: Found up-to-date module file ../../../Engine/Plugins/Media/MediaCompositing/Binaries/Win64/UE4Editor-MediaCompositingEditor.dll (API version 0).
 LogModuleManager: Display: Found up-to-date module file ../../../Engine/Plugins/Media/MediaPlayerEditor/Binaries/Win64/UE4Editor-MediaPlayerEditor.dll (API version 0).
 LogModuleManager: Display: Found up-to-date module file ../../../Engine/Plugins/Media/WmfMedia/Binaries/Win64/UE4Editor-WmfMedia.dll (API version 0).
 LogModuleManager: Display: Found up-to-date module file ../../../Engine/Plugins/Media/WmfMedia/Binaries/Win64/UE4Editor-WmfMediaEditor.dll (API version 0).
 LogModuleManager: Display: Found up-to-date module file ../../../Engine/Plugins/Media/WmfMedia/Binaries/Win64/UE4Editor-WmfMediaFactory.dll (API version 0).
 LogModuleManager: Display: Found up-to-date module file ../../../Engine/Plugins/Media/WmfMedia/Binaries/Win64/UE4Editor-WmfMediaFactory.dll (API version 0).
 LogModuleManager: Display: Found up-to-date module file ../../../Engine/Plugins/Messaging/TcpMessaging/Binaries/Win64/UE4Editor-TcpMessaging.dll (API version 0).
 LogModuleManager: Display: Found up-to-date module file ../../../Engine/Plugins/Messaging/UdpMessaging/Binaries/Win64/UE4Editor-UdpMessaging.dll (API version 0).
 LogModuleManager: Display: Found up-to-date module file ../../../Engine/Plugins/MovieScene/ActorSequence/Binaries/Win64/UE4Editor-ActorSequence.dll (API version 0).
 LogModuleManager: Display: Found up-to-date module file ../../../Engine/Plugins/MovieScene/LevelSequenceEditor/Binaries/Win64/UE4Editor-LevelSequenceEditor.dll (API version 0).
 LogModuleManager: Display: Found up-to-date module file ../../../Engine/Plugins/MovieScene/MatineeToLevelSequence/Binaries/Win64/UE4Editor-MatineeToLevelSequence.dll (API version 0).
 LogModuleManager: Display: Found up-to-date module file ../../../Engine/Plugins/NetcodeUnitTest/NetcodeUnitTest/Binaries/Win64/UE4Editor-NetcodeUnitTest.dll (API version 0).
 LogModuleManager: Display: Found up-to-date module file ../../../Engine/Plugins/NetcodeUnitTest/NUTUnrealEngine4/Binaries/Win64/UE4Editor-NUTUnrealEngine4.dll (API version 0).
 LogModuleManager: Display: Found up-to-date module file ../../../Engine/Plugins/Online/OnlineFramework/Binaries/Win64/UE4Editor-Qos.dll (API version 0).
 LogModuleManager: Display: Found up-to-date module file ../../../Engine/Plugins/Online/OnlineFramework/Binaries/Win64/UE4Editor-Party.dll (API version 0).
 LogModuleManager: Display: Found up-to-date module file ../../../Engine/Plugins/Online/OnlineFramework/Binaries/Win64/UE4Editor-Lobby.dll (API version 0).
 LogModuleManager: Display: Found up-to-date module file ../../../Engine/Plugins/Online/OnlineFramework/Binaries/Win64/UE4Editor-Hotfix.dll (API version 0).
 LogModuleManager: Display: Found up-to-date module file ../../../Engine/Plugins/Online/OnlineFramework/Binaries/Win64/UE4Editor-Rejoin.dll (API version 0).
 LogModuleManager: Display: Found up-to-date module file ../../../Engine/Plugins/Online/OnlineFramework/Binaries/Win64/UE4Editor-LoginFlow.dll (API version 0).
 LogModuleManager: Display: Found up-to-date module file ../../../Engine/Plugins/Online/OnlineSubsystem/Binaries/Win64/UE4Editor-OnlineSubsystem.dll (API version 0).
 LogModuleManager: Display: Found up-to-date module file ../../../Engine/Plugins/Online/OnlineSubsystemNull/Binaries/Win64/UE4Editor-OnlineSubsystemNull.dll (API version 0).
 LogModuleManager: Display: Found up-to-date module file ../../../Engine/Plugins/Online/OnlineSubsystemSteam/Binaries/Win64/UE4Editor-OnlineSubsystemSteam.dll (API version 0).
 LogModuleManager: Display: Found up-to-date module file ../../../Engine/Plugins/Online/OnlineSubsystemUtils/Binaries/Win64/UE4Editor-OnlineSubsystemUtils.dll (API version 0).
 LogModuleManager: Display: Found up-to-date module file ../../../Engine/Plugins/Online/OnlineSubsystemUtils/Binaries/Win64/UE4Editor-OnlineBlueprintSupport.dll (API version 0).
 LogModuleManager: Display: Found up-to-date module file ../../../Engine/Plugins/Runtime/AppleARKit/Binaries/Win64/UE4Editor-AppleARKit.dll (API version 0).
 LogModuleManager: Display: Found up-to-date module file ../../../Engine/Plugins/Runtime/ArchVisCharacter/Binaries/Win64/UE4Editor-ArchVisCharacter.dll (API version 0).
 LogModuleManager: Display: Found up-to-date module file ../../../Engine/Plugins/Runtime/AudioCapture/Binaries/Win64/UE4Editor-AudioCapture.dll (API version 0).
 LogModuleManager: Display: Found up-to-date module file ../../../Engine/Plugins/Runtime/AudioCapture/Binaries/Win64/UE4Editor-AudioCaptureEditor.dll (API version 0).
 LogModuleManager: Display: Found up-to-date module file ../../../Engine/Plugins/Runtime/CableComponent/Binaries/Win64/UE4Editor-CableComponent.dll (API version 0).
 LogModuleManager: Display: Found up-to-date module file ../../../Engine/Plugins/Runtime/CustomMeshComponent/Binaries/Win64/UE4Editor-CustomMeshComponent.dll (API version 0).
 LogModuleManager: Display: Found up-to-date module file ../../../Engine/Plugins/Runtime/ExampleDeviceProfileSelector/Binaries/Win64/UE4Editor-ExampleDeviceProfileSelector.dll (API version 0).
 LogModuleManager: Display: Found up-to-date module file ../../../Engine/Plugins/Runtime/ImmediatePhysics/Binaries/Win64/UE4Editor-ImmediatePhysics.dll (API version 0).
 LogModuleManager: Display: Found up-to-date module file ../../../Engine/Plugins/Runtime/ImmediatePhysics/Binaries/Win64/UE4Editor-ImmediatePhysicsEditor.dll (API version 0).
 LogModuleManager: Display: Found up-to-date module file ../../../Engine/Plugins/Runtime/MobilePatchingUtils/Binaries/Win64/UE4Editor-MobilePatchingUtils.dll (API version 0).
 LogModuleManager: Display: Found up-to-date module file ../../../Engine/Plugins/Runtime/Oculus/OculusVR/Binaries/Win64/UE4Editor-OculusHMD.dll (API version 0).
 LogModuleManager: Display: Found up-to-date module file ../../../Engine/Plugins/Runtime/Oculus/OculusVR/Binaries/Win64/UE4Editor-OculusInput.dll (API version 0).
 LogModuleManager: Display: Found up-to-date module file ../../../Engine/Plugins/Runtime/Oculus/OculusVR/Binaries/Win64/UE4Editor-OculusEditor.dll (API version 0).
 LogModuleManager: Display: Found up-to-date module file ../../../Engine/Plugins/Runtime/PhysXVehicles/Binaries/Win64/UE4Editor-PhysXVehicles.dll (API version 0).
 LogModuleManager: Display: Found up-to-date module file ../../../Engine/Plugins/Runtime/PhysXVehicles/Binaries/Win64/UE4Editor-PhysXVehiclesEditor.dll (API version 0).
 LogModuleManager: Display: Found up-to-date module file ../../../Engine/Plugins/Runtime/ProceduralMeshComponent/Binaries/Win64/UE4Editor-ProceduralMeshComponent.dll (API version 0).
 LogModuleManager: Display: Found up-to-date module file ../../../Engine/Plugins/Runtime/ProceduralMeshComponent/Binaries/Win64/UE4Editor-ProceduralMeshComponentEditor.dll (API version 0).
 LogModuleManager: Display: Found up-to-date module file ../../../Engine/Plugins/Runtime/RuntimePhysXCooking/Binaries/Win64/UE4Editor-RuntimePhysXCooking.dll (API version 0).
 LogModuleManager: Display: Found up-to-date module file ../../../Engine/Plugins/Runtime/WebBrowserWidget/Binaries/Win64/UE4Editor-WebBrowserWidget.dll (API version 0).
 LogModuleManager: Display: Found up-to-date module file ../../../Engine/Plugins/Runtime/WindowsMoviePlayer/Binaries/Win64/UE4Editor-WindowsMoviePlayer.dll (API version 0).
 LogModuleManager: Display: Found up-to-date module file ../../../../../Unreal Projects/Ultraball/Plugins/Marketplace/CommandLineParametersPlugin-master/Binaries/Win64/UE4Editor-CommandLineParametersPlugin.dll (API version 0).
 LogModuleManager: Display: Found up-to-date module file ../../../../../Unreal Projects/Ultraball/Plugins/Marketplace/VaRestPlugin/Binaries/Win64/UE4Editor-VaRestPlugin.dll (API version 0).
 LogModuleManager: Display: Found up-to-date module file ../../../../../Unreal Projects/Ultraball/Plugins/Marketplace/VaRestPlugin/Binaries/Win64/UE4Editor-VaRestEditorPlugin.dll (API version 0).
 LogInit: Using libcurl 7.47.1
 LogInit:  - built for x86_64-pc-win32
 LogInit:  - supports SSL with OpenSSL/1.0.2g
 LogInit:  - supports HTTP deflate (compression) using libz 1.2.8
 LogInit:  - other features:
 LogInit:      CURL_VERSION_SSL
 LogInit:      CURL_VERSION_LIBZ
 LogInit:      CURL_VERSION_IPV6
 LogInit:      CURL_VERSION_ASYNCHDNS
 LogInit:      CURL_VERSION_LARGEFILE
 LogInit:      CURL_VERSION_IDN
 LogInit:  CurlRequestOptions (configurable via config and command line):
 LogInit:  - bVerifyPeer = false  - Libcurl will NOT verify peer certificate
 LogInit:  - bUseHttpProxy = false  - Libcurl will NOT use HTTP proxy
 LogInit:  - bDontReuseConnections = false  - Libcurl will reuse connections
 LogInit:  - CertBundlePath = nullptr  - Libcurl will use whatever was configured at build time.
 LogInit:  - MaxHostConnections = 16  - Libcurl will limit the number of connections to a host
 LogInit:  - LocalHostAddr = Default
 LogOnline: Display: STEAM: Loading Steam SDK 1.39
 LogOnline: Warning: STEAM: Steam API disabled!
 LogOnline: Display: STEAM: OnlineSubsystemSteam::Shutdown()
 LogInit: WinSock: version 1.1 (2.2), MaxSocks=32767, MaxUdp=65467
 LogInit: WinSock: I am Blackbox (10.0.0.203:0)
 LogInit: Build: ++UE4+Release-4.19-CL-0
 LogInit: Engine Version: 4.19.0-0+++UE4+Release-4.19
 LogInit: Compatible Engine Version: 4.19.0-0+++UE4+Release-4.19
 LogInit: Net CL: 0
 LogDevObjectVersion: Number of dev versions registered: 18
 LogDevObjectVersion:   Dev-Blueprints (B0D832E4-1F89-4F0D-ACCF-7EB736FD4AA2): 10
 LogDevObjectVersion:   Dev-Build (E1C64328-A22C-4D53-A36C-8E866417BD8C): 0
 LogDevObjectVersion:   Dev-Core (375EC13C-06E4-48FB-B500-84F0262A717E): 2
 LogDevObjectVersion:   Dev-Editor (E4B068ED-F494-42E9-A231-DA0B2E46BB41): 23
 LogDevObjectVersion:   Dev-Framework (CFFC743F-43B0-4480-9391-14DF171D2073): 33
 LogDevObjectVersion:   Dev-Mobile (B02B49B5-BB20-44E9-A304-32B752E40360): 2
 LogDevObjectVersion:   Dev-Networking (A4E4105C-59A1-49B5-A7C5-40C4547EDFEE): 0
 LogDevObjectVersion:   Dev-Online (39C831C9-5AE6-47DC-9A44-9C173E1C8E7C): 0
 LogDevObjectVersion:   Dev-Physics (78F01B33-EBEA-4F98-B9B4-84EACCB95AA2): 0
 LogDevObjectVersion:   Dev-Platform (6631380F-2D4D-43E0-8009-CF276956A95A): 0
 LogDevObjectVersion:   Dev-Rendering (12F88B9F-8875-4AFC-A67C-D90C383ABD29): 25
 LogDevObjectVersion:   Dev-Sequencer (7B5AE74C-D270-4C10-A958-57980B212A5A): 6
 LogDevObjectVersion:   Dev-VR (D7296918-1DD6-4BDD-9DE2-64A83CC13884): 1
 LogDevObjectVersion:   Dev-LoadTimes (C2A15278-BFE7-4AFE-6C17-90FF531DF755): 1
 LogDevObjectVersion:   Private-Geometry (6EACA3D4-40EC-4CC1-B786-8BED09428FC5): 2
 LogDevObjectVersion:   Dev-AnimPhys (29E575DD-E0A3-4627-9D10-D276232CDCEA): 16
 LogDevObjectVersion:   Dev-ReflectionCapture (6B266CEC-1EC7-4B8F-A30B-E4D90942FC07): 1
 LogDevObjectVersion:   Dev-Automation (0DF73D61-A23F-47EA-B727-89E90C41499A): 1
 LogInit: Compiled (64-bit): Apr  6 2018 08:40:08
 LogInit: Compiled with Visual C++: 19.00.24215.01
 LogInit: Build Configuration: Development
 LogInit: Branch Name: ++UE4+Release-4.19
 LogInit: Command Line:  
 LogInit: Base Directory: C:/Users/Brian/Documents/GitHub/UnrealEngine/Engine/Binaries/Win64/
 LogInit: Installed Engine Build: 0
 LogStreaming: Display: Took  0.010s to delete old logs.
 LogInit: Presizing for max 8388607 objects, including 0 objects not considered by GC, pre-allocating 0 bytes for permanent pool.
 LogInit: Object subsystem initialized
 LogInit: Selected Device Profile: [Windows]
 LogInit: Applying CVar settings loaded from the selected device profile: [Windows]
 LogInit: Computer: BLACKBOX
 LogInit: User: Brian
 LogInit: CPU Page size=4096, Cores=4
 LogInit: High frequency timer resolution =3.410097 MHz
 LogMemory: Memory total: Physical=15.9GB (16GB approx)
 LogMemory: Platform Memory Stats for Windows
 LogMemory: Process Physical Memory: 278.32 MB used, 278.32 MB peak
 LogMemory: Process Virtual Memory: 283.48 MB used, 283.48 MB peak
 LogMemory: Physical Memory: 7353.47 MB used,  8936.25 MB free, 16289.72 MB total
 LogMemory: Virtual Memory: 652.10 MB used,  8936.25 MB free, 8388608.00 MB total
 LogInit: Using OS detected language (en-US).
 LogInit: Using OS detected locale (en-US).
 LogTextLocalizationManager: No specific localization for 'en-US' exists, so the 'en' localization will be used.
 LogStreaming: Display: Took  0.924s to EndInitTextLocalization.
 LogWindows: Failed to load 'shcore.dll' (GetLastError=126)
 LogWindows: File 'shcore.dll' does not exist
 LogInit: Setting process to DPI aware
 LogWindows: Failed to load 'shcore.dll' (GetLastError=126)
 LogWindows: File 'shcore.dll' does not exist
 LogInit: Setting process to DPI aware
 LogSlate: New Slate User Created.  User Index 0, Is Virtual User: 0
 LogSlate: Slate User Registered.  User Index 0, Is Virtual User: 0
 LogD3D11RHI: D3D11 adapters:
 LogD3D11RHI:    0. 'NVIDIA GeForce GTX 1070 Ti' (Feature Level 11_0)
 LogD3D11RHI:       8077/0/7888 MB DedicatedVideo/DedicatedSystem/SharedSystem, Outputs:1, VendorId:0x10de
 LogD3D11RHI: Chosen D3D11 Adapter: 0
 LogD3D11RHI: Creating new Direct3DDevice
 LogD3D11RHI:     GPU DeviceId: 0x1b82 (for the marketing name, search the web for "GPU Device Id")
 LogWindows: EnumDisplayDevices:
 LogWindows:    0. 'RDPDD Chained DD' (P:1 D:1)
 LogWindows:    1. 'RDPDD Chained DD' (P:0 D:0)
 LogWindows:    2. 'RDP Encoder Mirror Driver' (P:0 D:0)
 LogWindows:    3. 'RDP Reflector Display Driver' (P:0 D:0)
 LogWindows: DebugString: GetVideoDriverDetailsInvalid PrimaryIsNotTheChoosenAdapter GetVideoDriverDetailsInvalid PrimaryIsNotTheChoosenAdapter GetVideoDriverDetailsInvalid PrimaryIsNotTheChoosenAdapter GetVideoDriverDetailsInvalid PrimaryIsNotTheChoosenAdapter FoundDriverCount:0 
 LogD3D11RHI:     Adapter Name: NVIDIA GeForce GTX 1070 Ti
 LogD3D11RHI:   Driver Version: Unknown (internal:Unknown, unified:Unknown)
 LogD3D11RHI:      Driver Date: Unknown
 LogRHI: Texture pool is 5654 MB (70% of 8077 MB)
 LogD3D11RHI: [Aftermath] Aftermath enabled and primed
 LogD3D11RHI: Async texture creation enabled
 LogD3D11RHI: GPU Timing Frequency: 1000.000000 (Debug: 2 5)
 LogShaderCompilers: Guid format shader working directory is 6 characters bigger than the processId version (../../../../../Unreal Projects/Ultraball/Intermediate/Shaders/WorkingDirectory/9488/).
 LogShaderCompilers: Cleaned the shader compiler working directory 'C:/Users/Brian/AppData/Local/Temp/UnrealShaderWorkingDir/7DC4ED0F43934740DDB471ACF919A702/'.
 LogTemp: Display: Loaded TP AllDesktopTargetPlatform
 LogTemp: Display: Loaded TP MacClientTargetPlatform
 LogTemp: Display: Loaded TP MacNoEditorTargetPlatform
 LogTemp: Display: Loaded TP MacServerTargetPlatform
 LogTemp: Display: Loaded TP MacTargetPlatform
 LogTemp: Display: Loaded TP WindowsClientTargetPlatform
 LogTemp: Display: Loaded TP WindowsNoEditorTargetPlatform
 LogTemp: Display: Loaded TP WindowsServerTargetPlatform
 LogTemp: Display: Loaded TP WindowsTargetPlatform
 LogTemp: Display: Loaded TP Android_ASTCTargetPlatform
 LogTemp: Display: Loaded TP Android_ATCTargetPlatform
 LogTemp: Display: Loaded TP Android_DXTTargetPlatform
 LogTemp: Display: Loaded TP Android_ETC1aTargetPlatform
 LogTemp: Display: Loaded TP Android_ETC1TargetPlatform
 LogTemp: Display: Loaded TP Android_ETC2TargetPlatform
 LogTemp: Display: Loaded TP Android_MultiTargetPlatform
 LogTemp: Display: Loaded TP Android_PVRTCTargetPlatform
 LogTemp: Display: Loaded TP AndroidTargetPlatform
 LogTemp: Display: Loaded TP HTML5TargetPlatform
 LogTemp: Display: Loaded TP IOSTargetPlatform
 LogTemp: Display: Loaded TP TVOSTargetPlatform
 LogTemp: Display: Loaded TP LinuxClientTargetPlatform
 LogTemp: Display: Loaded TP LinuxNoEditorTargetPlatform
 LogTemp: Display: Loaded TP LinuxServerTargetPlatform
 LogTemp: Display: Loaded TP LinuxTargetPlatform
 LogTargetPlatformManager: Display: Building Assets For Windows
 LogXGEController: Cleaning working directory: C:/Users/Brian/AppData/Local/Temp/UnrealXGEWorkingDir/
 LogXGEController: Cannot use XGE Controller as Incredibuild is not installed on this machine.
 LogShaderCompilers: Cannot use XGE Shader Compiler as Incredibuild is not installed on this machine.
 LogShaderCompilers: Display: Using Local Shader Compiler.
 LogDerivedDataCache: Display: Max Cache Size: 512 MB
 LogDerivedDataCache: Loaded boot cache 0.93s 97MB ../../../../../Unreal Projects/Ultraball/DerivedDataCache/Boot.ddc.
 LogDerivedDataCache: Display: Loaded Boot cache: ../../../../../Unreal Projects/Ultraball/DerivedDataCache/Boot.ddc
 LogDerivedDataCache: FDerivedDataBackendGraph:  Pak pak cache file ../../../../../Unreal Projects/Ultraball/DerivedDataCache/DDC.ddp not found, will not use a pak cache.
 LogDerivedDataCache: Unable to find inner node Pak for hierarchical cache Hierarchy.
 LogDerivedDataCache: FDerivedDataBackendGraph:  EnginePak pak cache file ../../../Engine/DerivedDataCache/DDC.ddp not found, will not use a pak cache.
 LogDerivedDataCache: Unable to find inner node EnginePak for hierarchical cache Hierarchy.
 LogDerivedDataCache: Using Local data cache path ../../../Engine/DerivedDataCache: Writable
 LogDerivedDataCache: Shared data cache path not found in *engine.ini, will not use an Shared cache.
 LogDerivedDataCache: Unable to find inner node Shared for hierarchical cache Hierarchy.
 LogMaterial: Verifying Global Shaders for PCD3D_SM5
 LogSlate: Using Freetype 2.6.0
 LogSlate: SlateFontCache - WITH_FREETYPE: 1, WITH_HARFBUZZ: 1
 LogSlate: SlateFontCache - WITH_FREETYPE: 1, WITH_HARFBUZZ: 1
 LogAssetRegistry: FAssetRegistry took 0.0251 seconds to start up
 LogAssetRegistry: Warning: C:\Users\Brian\Documents\Unreal Projects\Ultraball\Content\Maps\UB_ArenaWide.umap: Package has invalid export /Game/Maps/UB_ArenaWide_BuiltData.UB_Arena1_BuiltData, resave source package!
 LogInit: Selected Device Profile: [Windows]
 LogMeshReduction: Using QuadricMeshReduction for automatic static mesh reduction
 LogMeshReduction: No automatic skeletal mesh reduction module available
 LogMeshReduction: No automatic mesh merging module available
 LogMeshReduction: No distributed automatic mesh merging module available
 LogMeshMerging: No automatic mesh merging module available
 LogMeshMerging: No distributed automatic mesh merging module available
 LogNetVersion: Ultraball , NetCL: 0, EngineNetVer: 2, GameNetVer: 0 (Checksum: 328595686)
 LogPackageLocalizationCache: Processed 9 localized package path(s) for 2 prioritized culture(s) in 0.169003 seconds
 LogUObjectArray: 36672 objects as part of root set at end of initial load.
 LogUObjectAllocator: 7518184 out of 0 bytes used by permanent object pool.
 LogUObjectArray: CloseDisregardForGC: 0/0 objects in disregard for GC pool
 LogStreaming: Warning: Failed to read file '../../../Engine/Content/Editor/Slate/Launcher/Mac/Platform_Mac_24x.png' error.
 LogSlate: Could not find file for Slate resource: ../../../Engine/Content/Editor/Slate/Launcher/Mac/Platform_Mac_24x.png
 LogStreaming: Warning: Failed to read file '../../../Engine/Content/Editor/Slate/Launcher/Mac/Platform_Mac_128x.png' error.
 LogSlate: Could not find file for Slate resource: ../../../Engine/Content/Editor/Slate/Launcher/Mac/Platform_Mac_128x.png
 LogStreaming: Warning: Failed to read file '../../../Engine/Content/Editor/Slate/Launcher/Mac/Platform_Mac_128x.png' error.
 LogSlate: Could not find file for Slate resource: ../../../Engine/Content/Editor/Slate/Launcher/Mac/Platform_Mac_128x.png
 LogStreaming: Warning: Failed to read file '../../../Engine/Content/Editor/Slate/Launcher/Mac/Platform_Mac_24x.png' error.
 LogSlate: Could not find file for Slate resource: ../../../Engine/Content/Editor/Slate/Launcher/Mac/Platform_Mac_24x.png
 LogStreaming: Warning: Failed to read file '../../../Engine/Content/Editor/Slate/Launcher/Mac/Platform_Mac_128x.png' error.
 LogSlate: Could not find file for Slate resource: ../../../Engine/Content/Editor/Slate/Launcher/Mac/Platform_Mac_128x.png
 LogStreaming: Warning: Failed to read file '../../../Engine/Content/Editor/Slate/Launcher/Mac/Platform_Mac_128x.png' error.
 LogSlate: Could not find file for Slate resource: ../../../Engine/Content/Editor/Slate/Launcher/Mac/Platform_Mac_128x.png
 LogStreaming: Warning: Failed to read file '../../../Engine/Content/Editor/Slate/Launcher/Mac/Platform_Mac_24x.png' error.
 LogSlate: Could not find file for Slate resource: ../../../Engine/Content/Editor/Slate/Launcher/Mac/Platform_Mac_24x.png
 LogStreaming: Warning: Failed to read file '../../../Engine/Content/Editor/Slate/Launcher/Mac/Platform_Mac_128x.png' error.
 LogSlate: Could not find file for Slate resource: ../../../Engine/Content/Editor/Slate/Launcher/Mac/Platform_Mac_128x.png
 LogStreaming: Warning: Failed to read file '../../../Engine/Content/Editor/Slate/Launcher/Mac/Platform_Mac_128x.png' error.
 LogSlate: Could not find file for Slate resource: ../../../Engine/Content/Editor/Slate/Launcher/Mac/Platform_Mac_128x.png
 LogStreaming: Warning: Failed to read file '../../../Engine/Content/Editor/Slate/Launcher/Mac/Platform_Mac_24x.png' error.
 LogSlate: Could not find file for Slate resource: ../../../Engine/Content/Editor/Slate/Launcher/Mac/Platform_Mac_24x.png
 LogStreaming: Warning: Failed to read file '../../../Engine/Content/Editor/Slate/Launcher/Mac/Platform_Mac_128x.png' error.
 LogSlate: Could not find file for Slate resource: ../../../Engine/Content/Editor/Slate/Launcher/Mac/Platform_Mac_128x.png
 LogStreaming: Warning: Failed to read file '../../../Engine/Content/Editor/Slate/Launcher/Mac/Platform_Mac_128x.png' error.
 LogSlate: Could not find file for Slate resource: ../../../Engine/Content/Editor/Slate/Launcher/Mac/Platform_Mac_128x.png
 LogStreaming: Warning: Failed to read file '../../../Engine/Content/Editor/Slate/Launcher/Android/Platform_Android_24x.png' error.
 LogSlate: Could not find file for Slate resource: ../../../Engine/Content/Editor/Slate/Launcher/Android/Platform_Android_24x.png
 LogStreaming: Warning: Failed to read file '../../../Engine/Content/Editor/Slate/Launcher/Android/Platform_Android_128x.png' error.
 LogSlate: Could not find file for Slate resource: ../../../Engine/Content/Editor/Slate/Launcher/Android/Platform_Android_128x.png
 LogStreaming: Warning: Failed to read file '../../../Engine/Content/Editor/Slate/Launcher/Android/Platform_Android_128x.png' error.
 LogSlate: Could not find file for Slate resource: ../../../Engine/Content/Editor/Slate/Launcher/Android/Platform_Android_128x.png
 LogStreaming: Warning: Failed to read file '../../../Engine/Content/Editor/Slate/Launcher/Android/Platform_Android_24x.png' error.
 LogSlate: Could not find file for Slate resource: ../../../Engine/Content/Editor/Slate/Launcher/Android/Platform_Android_24x.png
 LogStreaming: Warning: Failed to read file '../../../Engine/Content/Editor/Slate/Launcher/Android/Platform_Android_128x.png' error.
 LogSlate: Could not find file for Slate resource: ../../../Engine/Content/Editor/Slate/Launcher/Android/Platform_Android_128x.png
 LogStreaming: Warning: Failed to read file '../../../Engine/Content/Editor/Slate/Launcher/Android/Platform_Android_128x.png' error.
 LogSlate: Could not find file for Slate resource: ../../../Engine/Content/Editor/Slate/Launcher/Android/Platform_Android_128x.png
 LogStreaming: Warning: Failed to read file '../../../Engine/Content/Editor/Slate/Launcher/Android/Platform_Android_ATC_24x.png' error.
 LogSlate: Could not find file for Slate resource: ../../../Engine/Content/Editor/Slate/Launcher/Android/Platform_Android_ATC_24x.png
 LogStreaming: Warning: Failed to read file '../../../Engine/Content/Editor/Slate/Launcher/Android/Platform_Android_128x.png' error.
 LogSlate: Could not find file for Slate resource: ../../../Engine/Content/Editor/Slate/Launcher/Android/Platform_Android_128x.png
 LogStreaming: Warning: Failed to read file '../../../Engine/Content/Editor/Slate/Launcher/Android/Platform_Android_128x.png' error.
 LogSlate: Could not find file for Slate resource: ../../../Engine/Content/Editor/Slate/Launcher/Android/Platform_Android_128x.png
 LogStreaming: Warning: Failed to read file '../../../Engine/Content/Editor/Slate/Launcher/Android/Platform_Android_DXT_24x.png' error.
 LogSlate: Could not find file for Slate resource: ../../../Engine/Content/Editor/Slate/Launcher/Android/Platform_Android_DXT_24x.png
 LogStreaming: Warning: Failed to read file '../../../Engine/Content/Editor/Slate/Launcher/Android/Platform_Android_128x.png' error.
 LogSlate: Could not find file for Slate resource: ../../../Engine/Content/Editor/Slate/Launcher/Android/Platform_Android_128x.png
 LogStreaming: Warning: Failed to read file '../../../Engine/Content/Editor/Slate/Launcher/Android/Platform_Android_128x.png' error.
 LogSlate: Could not find file for Slate resource: ../../../Engine/Content/Editor/Slate/Launcher/Android/Platform_Android_128x.png
 LogStreaming: Warning: Failed to read file '../../../Engine/Content/Editor/Slate/Launcher/Android/Platform_Android_ETC1_24x.png' error.
 LogSlate: Could not find file for Slate resource: ../../../Engine/Content/Editor/Slate/Launcher/Android/Platform_Android_ETC1_24x.png
 LogStreaming: Warning: Failed to read file '../../../Engine/Content/Editor/Slate/Launcher/Android/Platform_Android_128x.png' error.
 LogSlate: Could not find file for Slate resource: ../../../Engine/Content/Editor/Slate/Launcher/Android/Platform_Android_128x.png
 LogStreaming: Warning: Failed to read file '../../../Engine/Content/Editor/Slate/Launcher/Android/Platform_Android_128x.png' error.
 LogSlate: Could not find file for Slate resource: ../../../Engine/Content/Editor/Slate/Launcher/Android/Platform_Android_128x.png
 LogStreaming: Warning: Failed to read file '../../../Engine/Content/Editor/Slate/Launcher/Android/Platform_Android_ETC2_24x.png' error.
 LogSlate: Could not find file for Slate resource: ../../../Engine/Content/Editor/Slate/Launcher/Android/Platform_Android_ETC2_24x.png
 LogStreaming: Warning: Failed to read file '../../../Engine/Content/Editor/Slate/Launcher/Android/Platform_Android_128x.png' error.
 LogSlate: Could not find file for Slate resource: ../../../Engine/Content/Editor/Slate/Launcher/Android/Platform_Android_128x.png
 LogStreaming: Warning: Failed to read file '../../../Engine/Content/Editor/Slate/Launcher/Android/Platform_Android_128x.png' error.
 LogSlate: Could not find file for Slate resource: ../../../Engine/Content/Editor/Slate/Launcher/Android/Platform_Android_128x.png
 LogStreaming: Warning: Failed to read file '../../../Engine/Content/Editor/Slate/Launcher/Android/Platform_Android_ETC2_24x.png' error.
 LogSlate: Could not find file for Slate resource: ../../../Engine/Content/Editor/Slate/Launcher/Android/Platform_Android_ETC2_24x.png
 LogStreaming: Warning: Failed to read file '../../../Engine/Content/Editor/Slate/Launcher/Android/Platform_Android_128x.png' error.
 LogSlate: Could not find file for Slate resource: ../../../Engine/Content/Editor/Slate/Launcher/Android/Platform_Android_128x.png
 LogStreaming: Warning: Failed to read file '../../../Engine/Content/Editor/Slate/Launcher/Android/Platform_Android_128x.png' error.
 LogSlate: Could not find file for Slate resource: ../../../Engine/Content/Editor/Slate/Launcher/Android/Platform_Android_128x.png
 LogStreaming: Warning: Failed to read file '../../../Engine/Content/Editor/Slate/Launcher/Android/Platform_Android_PVRTC_24x.png' error.
 LogSlate: Could not find file for Slate resource: ../../../Engine/Content/Editor/Slate/Launcher/Android/Platform_Android_PVRTC_24x.png
 LogStreaming: Warning: Failed to read file '../../../Engine/Content/Editor/Slate/Launcher/Android/Platform_Android_128x.png' error.
 LogSlate: Could not find file for Slate resource: ../../../Engine/Content/Editor/Slate/Launcher/Android/Platform_Android_128x.png
 LogStreaming: Warning: Failed to read file '../../../Engine/Content/Editor/Slate/Launcher/Android/Platform_Android_128x.png' error.
 LogSlate: Could not find file for Slate resource: ../../../Engine/Content/Editor/Slate/Launcher/Android/Platform_Android_128x.png
 LogStreaming: Warning: Failed to read file '../../../Engine/Content/Editor/Slate/Launcher/Android/Platform_Android_ASTC_24x.png' error.
 LogSlate: Could not find file for Slate resource: ../../../Engine/Content/Editor/Slate/Launcher/Android/Platform_Android_ASTC_24x.png
 LogStreaming: Warning: Failed to read file '../../../Engine/Content/Editor/Slate/Launcher/Android/Platform_Android_128x.png' error.
 LogSlate: Could not find file for Slate resource: ../../../Engine/Content/Editor/Slate/Launcher/Android/Platform_Android_128x.png
 LogStreaming: Warning: Failed to read file '../../../Engine/Content/Editor/Slate/Launcher/Android/Platform_Android_128x.png' error.
 LogSlate: Could not find file for Slate resource: ../../../Engine/Content/Editor/Slate/Launcher/Android/Platform_Android_128x.png
 LogTcpMessaging: Initializing TcpMessaging bridge
 LogUdpMessaging: Initializing bridge on interface 0.0.0.0:0 to multicast group 230.0.0.1:6666.
 SourceControl: Source control is disabled
 SourceControl: Source control is disabled
 SourceControl: Source control is disabled
 LogOcInput: OculusInput pre-init called
 LogEngine: Initializing Engine...
 LogStats: UGameplayTagsManager::ConstructGameplayTagTree: Construct from data asset -  0.000 s
 LogStats: UGameplayTagsManager::ConstructGameplayTagTree: GameplayTagTreeChangedEvent.Broadcast -  0.000 s
 LogAIModule: Creating AISystem for world Untitled
 LogInit: XAudio2 using 'Remote Audio' : 2 channels at 44.1 kHz using 16 bits per sample (channel mask 0x3)
 LogInit: FAudioDevice initialized.
 LogDerivedDataCache: Saved boot cache 0.21s 97MB ../../../../../Unreal Projects/Ultraball/DerivedDataCache/Boot.ddc.
 LogInit: Texture streaming: Disabled
 LogEngineSessionManager: EngineSessionManager initialized
 LogInit: Transaction tracking system initialized
 BlueprintLog: New page: Editor Load
 LocalizationService: Localization service is disabled
 LogFileCache: Scanning file cache for directory 'C:/Users/Brian/Documents/Unreal Projects/Ultraball/Content/' took 0.04s
 LogCook: Display: Max memory allowance for cook 16384mb min free memory 0mb
 LogCook: Display: Mobile HDR setting 0
 LogGameplayTags: Display: UGameplayTagsManager::DoneAddingNativeTags. DelegateIsBound: 0
 LogStats: UGameplayTagsManager::ConstructGameplayTagTree: Construct from data asset -  0.000 s
 LogStats: UGameplayTagsManager::ConstructGameplayTagTree: GameplayTagTreeChangedEvent.Broadcast -  0.000 s
 LogSourceControl: Attempting "svn info --xml "../../../../../Unreal Projects/Ultraball/" --non-interactive --trust-server-cert --username Inphidel --password ********"
 LogSourceControl: Unable to detect system-level svn binary.
 LogSourceControl: Using path C:/Users/Brian/Documents/GitHub/UnrealEngine/Engine/Binaries/ThirdParty/svn/Win64/svn.exe for svn operations
 SourceControl: Warning: Successfully connected to repository https://Blackbox/svn/Ultraball/
 Cmd: MAP LOAD FILE="../../../../../Unreal Projects/Ultraball/Content/Maps/UB_ArenaWide.umap" TEMPLATE=0 SHOWPROGRESS=1 FEATURELEVEL=3
 LightingResults: New page: Lighting Build
 MapCheck: New page: Map Check
 LightingResults: New page: Lighting Build
 LogSkeletalMesh: Skeletal Mesh found in DDC [43.519875ms] /Game/Characters/RoboJock/Destruct/RoboJock_D_Unlinked.RoboJock_D_Unlinked
 LogSkeletalMesh: Skeletal Mesh found in DDC [28.266937ms] /Game/Characters/RoboJock/FirstPerson/ArmsRoboJock_Mesh.ArmsRoboJock_Mesh
 LogSkeletalMesh: Skeletal Mesh found in DDC [38.326183ms] /Game/Characters/RoboJock/RoboJock_Mesh.RoboJock_Mesh
 LogAIModule: Creating AISystem for world UB_ArenaWide
 LogEditorServer: Finished looking for orphan Actors (0.000 secs)
 Cmd: MAP CHECKDEP NOCLEARLOG
 MapCheck: Map check complete: 0 Error(s), 0 Warning(s), took 160.219ms to complete.
 LogFileHelpers: Loading map 'UB_ArenaWide' took 129.120
 LogSourceControl: Attempting "svn info "C:/Users/Brian/Documents/Unreal Projects/Ultraball/" --xml --non-interactive --trust-server-cert --username Inphidel --password ********"
 LogCollectionManager: Loaded 1 collections in 0.006014 seconds
 LogFileCache: Scanning file cache for directory 'C:/Users/Brian/Documents/Unreal Projects/Ultraball/Saved/Collections/' took 0.01s
 LogFileCache: Scanning file cache for directory 'C:/Users/Brian/Documents/Unreal Projects/Ultraball/Content/Developers/Brian/Collections/' took 0.01s
 LogFileCache: Scanning file cache for directory 'C:/Users/Brian/Documents/Unreal Projects/Ultraball/Content/Collections/' took 0.01s
 LogSourceControl: Attempting "svn status --show-updates --verbose --xml "C:/Users/Brian/Documents/Unreal Projects/Ultraball/" --non-interactive --trust-server-cert --username Inphidel --password ********"
 LogCollectionManager: Rebuilt the GUID cache for 1 collections in 0.000002 seconds
 LogCollectionManager: Rebuilt the hierarchy cache for 1 collections in 0.000000 seconds
 LogContentBrowser: Native class hierarchy populated in 0.0093 seconds. Added 2477 classes and 572 folders.
 LogContentBrowser: Native class hierarchy updated for 'WidgetCarousel' in 0.0005 seconds. Added 0 classes and 0 folders.
 LogContentBrowser: Native class hierarchy updated for 'AddContentDialog' in 0.0005 seconds. Added 0 classes and 0 folders.
 LogContentBrowser: Native class hierarchy updated for 'SceneOutliner' in 0.0006 seconds. Added 1 classes and 2 folders.
 LogSlate: Took 0.106952 seconds to synchronously load lazily loaded font '../../../Engine/Content/Slate/Fonts/Roboto-Regular.ttf' (155K)
 LogSlate: Took 0.087582 seconds to synchronously load lazily loaded font '../../../Engine/Content/Slate/Fonts/Roboto-Bold.ttf' (160K)
 LogRenderer: Reallocating scene render targets to support 1020x284 Format 10 NumSamples 1 (Frame:1).
 LogContentBrowser: Native class hierarchy updated for 'HierarchicalLODOutliner' in 0.0006 seconds. Added 0 classes and 0 folders.
 LogLoad: (Engine Initialization) Total time: 343.48 seconds
 LogLoad: (Engine Initialization) Total Blueprint compile time: 0.00 seconds
 LogAssetRegistry: Asset discovery search completed in 273.7276 seconds
 LogCollectionManager: Rebuilt the object cache for 1 collections in 0.000004 seconds (found 0 objects)
 LogCollectionManager: Fixed up redirectors for 1 collections in 0.000052 seconds (updated 0 objects)
 LogSlate: FSceneViewport::OnFocusLost() reason 2
 UATHelper: Packaging (Linux): Running AutomationTool...
 LogSlate: FSceneViewport::OnFocusLost() reason 0
 LogSlate: Took 0.153504 seconds to synchronously load lazily loaded font '../../../Engine/Content/Editor/Slate/Fonts/FontAwesome.ttf' (139K)
 LogSlate: Took 0.067769 seconds to synchronously load lazily loaded font '../../../Engine/Content/Slate/Fonts/DroidSansMono.ttf' (77K)
 UATHelper: Packaging (Linux): Parsing command line: -ScriptsForProject="C:/Users/Brian/Documents/Unreal Projects/Ultraball/Ultraball.uproject" BuildCookRun -nocompileeditor -nop4 -project="C:/Users/Brian/Documents/Unreal Projects/Ultraball/Ultraball.uproject" -cook -stage -archive -archivedirectory=C:/Users/Brian/Desktop/Gibball_Alpha/Shipping -package -clie
 ntconfig=Development -ue4exe=UE4Editor-Cmd.exe -prereqs -nodebuginfo -targetplatform=Linux -build -CrashReporter -utf8output -compile
 UATHelper: Packaging (Linux): Compiling scripts.
 UATHelper: Packaging (Linux):     DotNETUtilities -> C:\Users\Brian\Documents\GitHub\UnrealEngine\Engine\Binaries\DotNET\DotNETUtilities.dll
 UATHelper: Packaging (Linux):     UnrealBuildTool -> C:\Users\Brian\Documents\GitHub\UnrealEngine\Engine\Binaries\DotNET\UnrealBuildTool.exe
 UATHelper: Packaging (Linux):     AutomationUtils.Automation -> C:\Users\Brian\Documents\GitHub\UnrealEngine\Engine\Binaries\DotNET\AutomationUtils.Automation.dll
 UATHelper: Packaging (Linux):     AllDesktop.Automation -> C:\Users\Brian\Documents\GitHub\UnrealEngine\Engine\Binaries\DotNET\AutomationScripts\AllDesktop\AllDesktop.Automation.dll
 UATHelper: Packaging (Linux):     Localization.Automation -> C:\Users\Brian\Documents\GitHub\UnrealEngine\Engine\Binaries\DotNET\AutomationScripts\Localization.Automation.dll
 UATHelper: Packaging (Linux):     OneSkyLocalization.Automation -> C:\Users\Brian\Documents\GitHub\UnrealEngine\Engine\Binaries\DotNET\AutomationScripts\OneSkyLocalization.Automation.dll
 UATHelper: Packaging (Linux):     AutomationScripts.Automation -> C:\Users\Brian\Documents\GitHub\UnrealEngine\Engine\Binaries\DotNET\AutomationScripts\AutomationScripts.Automation.dll
 UATHelper: Packaging (Linux):     Android.Automation -> C:\Users\Brian\Documents\GitHub\UnrealEngine\Engine\Binaries\DotNET\AutomationScripts\Android\Android.Automation.dll
 UATHelper: Packaging (Linux):     BuildGraph.Automation -> C:\Users\Brian\Documents\GitHub\UnrealEngine\Engine\Binaries\DotNET\AutomationScripts\BuildGraph.Automation.dll
 UATHelper: Packaging (Linux):     HTML5.Automation -> C:\Users\Brian\Documents\GitHub\UnrealEngine\Engine\Binaries\DotNET\AutomationScripts\HTML5\HTML5.Automation.dll
 UATHelper: Packaging (Linux):     MobileDeviceInterface -> C:\Users\Brian\Documents\GitHub\UnrealEngine\Engine\Binaries\DotNET\IOS\MobileDeviceInterface.dll
 UATHelper: Packaging (Linux):     IOS.Automation -> C:\Users\Brian\Documents\GitHub\UnrealEngine\Engine\Binaries\DotNET\AutomationScripts\IOS\IOS.Automation.dll
 UATHelper: Packaging (Linux):     Linux.Automation -> C:\Users\Brian\Documents\GitHub\UnrealEngine\Engine\Binaries\DotNET\AutomationScripts\Linux\Linux.Automation.dll
 UATHelper: Packaging (Linux):     Mac.Automation -> C:\Users\Brian\Documents\GitHub\UnrealEngine\Engine\Binaries\DotNET\AutomationScripts\Mac\Mac.Automation.dll
 UATHelper: Packaging (Linux):     TVOS.Automation -> C:\Users\Brian\Documents\GitHub\UnrealEngine\Engine\Binaries\DotNET\AutomationScripts\TVOS\TVOS.Automation.dll
 UATHelper: Packaging (Linux):     Win.Automation -> C:\Users\Brian\Documents\GitHub\UnrealEngine\Engine\Binaries\DotNET\AutomationScripts\Win.Automation.dll
 UATHelper: Packaging (Linux):     XLocLocalization.Automation -> C:\Users\Brian\Documents\GitHub\UnrealEngine\Engine\Binaries\DotNET\AutomationScripts\XLocLocalization.Automation.dll
 UATHelper: Packaging (Linux): Took 14.9728564s to run MSBuild.exe, ExitCode=0
 UATHelper: Packaging (Linux): Setting up ProjectParams for C:\Users\Brian\Documents\Unreal Projects\Ultraball\Ultraball.uproject
 UATHelper: Packaging (Linux): ********** BUILD COMMAND STARTED **********
 UATHelper: Packaging (Linux): Running: C:\Program Files (x86)\MSBuild\14.0\bin\MSBuild.exe C:/Users/Brian/Documents/GitHub/UnrealEngine/Engine/Source/Programs/UnrealBuildTool/UnrealBuildTool.csproj /verbosity:minimal /nologo /property:Configuration=Development /property:Platform=AnyCPU
 UATHelper: Packaging (Linux):     DotNETUtilities -> C:\Users\Brian\Documents\GitHub\UnrealEngine\Engine\Binaries\DotNET\DotNETUtilities.dll
 UATHelper: Packaging (Linux):     UnrealBuildTool -> C:\Users\Brian\Documents\GitHub\UnrealEngine\Engine\Binaries\DotNET\UnrealBuildTool.exe
 UATHelper: Packaging (Linux): Took 1.1250643s to run MSBuild.exe, ExitCode=0
 UATHelper: Packaging (Linux): Running: C:\Users\Brian\Documents\GitHub\UnrealEngine\Engine\Binaries\DotNET\UnrealBuildTool.exe Ultraball Linux Development -Project="C:\Users\Brian\Documents\Unreal Projects\Ultraball\Ultraball.uproject"  "C:\Users\Brian\Documents\Unreal Projects\Ultraball\Ultraball.uproject" -NoUBTMakefiles  -remoteini="C:\Users\Brian\Documen
 ts\Unreal Projects\Ultraball" -skipdeploy -noxge -generatemanifest -NoHotReload
 UATHelper: Packaging (Linux):   Using 'git status' to determine working set for adaptive non-unity build.
 UATHelper: Packaging (Linux):   Using LINUX_MULTIARCH_ROOT, building with toolchain 'C:\UE-Toolchain\v11_clang-5.0.0-centos7\x86_64-unknown-linux-gnu'
 UATHelper: Packaging (Linux): Took 22.2142706s to run UnrealBuildTool.exe, ExitCode=0
 UATHelper: Packaging (Linux): Running: C:\Users\Brian\Documents\GitHub\UnrealEngine\Engine\Binaries\DotNET\UnrealBuildTool.exe Ultraball Linux Development -Project="C:\Users\Brian\Documents\Unreal Projects\Ultraball\Ultraball.uproject"  "C:\Users\Brian\Documents\Unreal Projects\Ultraball\Ultraball.uproject" -NoUBTMakefiles  -remoteini="C:\Users\Brian\Documen
 ts\Unreal Projects\Ultraball" -skipdeploy -noxge -NoHotReload -ignorejunk
 UATHelper: Packaging (Linux):   Using 'git status' to determine working set for adaptive non-unity build.
 UATHelper: Packaging (Linux):   Using LINUX_MULTIARCH_ROOT, building with toolchain 'C:\UE-Toolchain\v11_clang-5.0.0-centos7\x86_64-unknown-linux-gnu'
 UATHelper: Packaging (Linux):   Building UnrealHeaderTool...
 UATHelper: Packaging (Linux):   Using 'git status' to determine working set for adaptive non-unity build.
 UATHelper: Packaging (Linux):   Creating makefile for UnrealHeaderTool (UnrealBuildTool.exe is newer)
 UATHelper: Packaging (Linux):   Target is up to date
 UATHelper: Packaging (Linux):   Total build time: 2.93 seconds (NoActionsToExecute executor: 0.00 seconds)
 UATHelper: Packaging (Linux):   Parsing headers for Ultraball
 UATHelper: Packaging (Linux):     Running UnrealHeaderTool "C:\Users\Brian\Documents\Unreal Projects\Ultraball\Ultraball.uproject" "C:\Users\Brian\Documents\Unreal Projects\Ultraball\Intermediate\Build\Linux\B4D820EA\Ultraball\Development\Ultraball.uhtmanifest" -LogCmds="loginit warning, logexit warning, logdatabase error" -Unattended -WarningsAsErrors
 UATHelper: Packaging (Linux):   LogPluginManager: Warning: Engine version string in ../../../../../Unreal Projects/Ultraball/Plugins/Marketplace/CommandLineParametersPlugin-master/CommandLineParametersPlugin.uplugin could not be parsed ("1579795")
 PackagingResults: Warning: Engine version string in ../../../../../Unreal Projects/Ultraball/Plugins/Marketplace/CommandLineParametersPlugin-master/CommandLineParametersPlugin.uplugin could not be parsed ("1579795")
 UATHelper: Packaging (Linux):   Reflection code generated for Ultraball in 55.3814947 seconds
 UATHelper: Packaging (Linux):   ------- Build details --------
 UATHelper: Packaging (Linux):   Using clang (C:/UE-Toolchain/v11_clang-5.0.0-centos7/x86_64-unknown-linux-gnu\bin\clang++.exe) version '5.0.0' (string), 5 (major), 0 (minor), 0 (patch)
 UATHelper: Packaging (Linux):   Using bundled libc++ standard C++ library.
 UATHelper: Packaging (Linux):   Using lld linker
 UATHelper: Packaging (Linux):   Using llvm-ar : llvm-ar.exe
 UATHelper: Packaging (Linux):   Using old way to relink circularly dependent libraries (with a FixDeps step).
 UATHelper: Packaging (Linux):   ------------------------------
 UATHelper: Packaging (Linux):   C:\Users\Brian\Documents\GitHub\UnrealEngine\Engine\Source\Runtime\Core\Private\Internationalization\ICURegex.cpp(1): error: Expected ICURegex.h to be first header included.
 UATHelper: Packaging (Linux):   ERROR: Build canceled.
 PackagingResults: Error: Expected ICURegex.h to be first header included.
 PackagingResults: Error: Build canceled.
 UATHelper: Packaging (Linux): Took 82.1747002s to run UnrealBuildTool.exe, ExitCode=1
 UATHelper: Packaging (Linux): ERROR: Command failed (Result:1): C:\Users\Brian\Documents\GitHub\UnrealEngine\Engine\Binaries\DotNET\UnrealBuildTool.exe Ultraball Linux Development -Project="C:\Users\Brian\Documents\Unreal Projects\Ultraball\Ultraball.uproject"  "C:\Users\Brian\Documents\Unreal Projects\Ultraball\Ultraball.uproject" -NoUBTMakefiles  -remotein
 i="C:\Users\Brian\Documents\Unreal Projects\Ultraball" -skipdeploy -noxge -NoHotReload -ignorejunk. See logfile for details: 'UnrealBuildTool-2018.04.06-14.28.19.txt' 
 UATHelper: Packaging (Linux):        (see C:\Users\Brian\Documents\GitHub\UnrealEngine\Engine\Programs\AutomationTool\Saved\Logs\UAT_Log.txt for full exception trace)
 UATHelper: Packaging (Linux): AutomationTool exiting with ExitCode=1 (Error_Unknown)
 PackagingResults: Error: Command failed (Result:1): C:\Users\Brian\Documents\GitHub\UnrealEngine\Engine\Binaries\DotNET\UnrealBuildTool.exe Ultraball Linux Development -Project="C:\Users\Brian\Documents\Unreal Projects\Ultraball\Ultraball.uproject"  "C:\Users\Brian\Documents\Unreal Projects\Ultraball\Ultraball.uproject" -NoUBTMakefiles  -remoteini="C:\Users\
 Brian\Documents\Unreal Projects\Ultraball" -skipdeploy -noxge -NoHotReload -ignorejunk. See logfile for details: 'UnrealBuildTool-2018.04.06-14.28.19.txt' 
 UATHelper: Packaging (Linux): BUILD FAILED
 PackagingResults: Error: Unknown Error
 
Product Version: UE 4.19
Tags:
more ▼

asked Apr 06 '18 at 10:49 PM in Packaging & Deployment

avatar image

Inph1del
172 15 24 93

avatar image Inph1del Apr 06 '18 at 09:38 PM

cannot build anything but editor in linux actually dev wont build either

avatar image Inph1del Apr 08 '18 at 05:05 PM
 UATHelper: Packaging (Linux):   Reflection code generated for Ultraball in 55.3814947 seconds
  UATHelper: Packaging (Linux):   ------- Build details --------
  UATHelper: Packaging (Linux):   Using clang (C:/UE-Toolchain/v11_clang-5.0.0-centos7/x86_64-unknown-linux-gnu\bin\clang++.exe) version '5.0.0' (string), 5 (major), 0 (minor), 0 (patch)
  UATHelper: Packaging (Linux):   Using bundled libc++ standard C++ library.
  UATHelper: Packaging (Linux):   Using lld linker
  UATHelper: Packaging (Linux):   Using llvm-ar : llvm-ar.exe
  UATHelper: Packaging (Linux):   Using old way to relink circularly dependent libraries (with a FixDeps step).
  UATHelper: Packaging (Linux):   ------------------------------
  UATHelper: Packaging (Linux):   C:\Users\Brian\Documents\GitHub\UnrealEngine\Engine\Source\Runtime\Core\Private\Internationalization\ICURegex.cpp(1): error: Expected ICURegex.h to be first header included.
  UATHelper: Packaging (Linux):   ERROR: Build canceled.
  PackagingResults: Error: Expected ICURegex.h to be first header included.
  PackagingResults: Error: Build canceled.
 

seems to be the circular dependency in source i can't get around.

(comments are locked)
10|2000 characters needed characters left
Viewable by all users

2 answers: sort voted first

Could you please check what's in your ICURegex.cpp ? Stock engine has ICURegex.h as the first include: https://github.com/EpicGames/UnrealEngine/blob/release/Engine/Source/Runtime/Core/Private/Internationalization/ICURegex.cpp#L3

more ▼

answered Apr 10 '18 at 03:12 PM

avatar image

RCL STAFF
2.7k 59 6 88

avatar image Inph1del Apr 10 '18 at 04:26 PM

Which is why I am confused mine does as well, I’m assuming the .h is not generating something. I’m going to try Re downloading source again as zip when I return home

(comments are locked)
10|2000 characters needed characters left
Viewable by all users

Try running a clean build, if you've just upgraded.

more ▼

answered Nov 19 '18 at 08:02 PM

avatar image

Matt.deWet
1

(comments are locked)
10|2000 characters needed characters left
Viewable by all users
Your answer
toggle preview:

Up to 5 attachments (including images) can be used with a maximum of 5.2 MB each and 5.2 MB total.

Follow this question

Once you sign in you will be able to subscribe for any updates here

Answers to this question