x

Search in
Sort by:

Question Status:

Search help

  • Simple searches use one or more words. Separate the words with spaces (cat dog) to search cat,dog or both. Separate the words with plus signs (cat +dog) to search for items that may contain cat but must contain dog.
  • You can further refine your search on the search results page, where you can search by keywords, author, topic. These can be combined with each other. Examples
    • cat dog --matches anything with cat,dog or both
    • cat +dog --searches for cat +dog where dog is a mandatory term
    • cat -dog -- searches for cat excluding any result containing dog
    • [cats] —will restrict your search to results with topic named "cats"
    • [cats] [dogs] —will restrict your search to results with both topics, "cats", and "dogs"

Android packaging failed.

I am trying to build an empty project with UE 4.19.2 GitHub version and get the following errors while packaging for Android platform:

 UATHelper: Packaging (Android (ASTC)):   Compiling Native code with NDK API 'android-19'
 UATHelper: Packaging (Android (ASTC)):   Performing 391 actions (4 in parallel)
 UATHelper: Packaging (Android (ASTC)):   [3/391] clang++.exe SharedPCH.CoreUObject.h [armv7-es2]
 UATHelper: Packaging (Android (ASTC)):   [4/391] clang++.exe SharedPCH.Core.h [armv7-es2]
 UATHelper: Packaging (Android (ASTC)):   [1/391] clang++.exe SharedPCH.Engine.h [armv7-es2]
 UATHelper: Packaging (Android (ASTC)):   [2/391] clang++.exe PCH.Engine.h [armv7-es2]
 UATHelper: Packaging (Android (ASTC)):   [5/391] clang++.exe PCH.Core.h [armv7-es2]
 ...
 ...
 ...
 UATHelper: Packaging (Android (ASTC)):   [388/391] arm-linux-androideabi-ar.exe TESTGAME-ExampleDeviceProfileSelector-armv7-es2.a
 UATHelper: Packaging (Android (ASTC)):   [389/391] arm-linux-androideabi-ar.exe TESTGAME-OnlineSubsystemNull-armv7-es2.a
 UATHelper: Packaging (Android (ASTC)):   [390/391] arm-linux-androideabi-ar.exe TESTGAME-RuntimePhysXCooking-armv7-es2.a
 UATHelper: Packaging (Android (ASTC)):   [391/391] clang++.exe TESTGAME-armv7-es2.so
 UATHelper: Packaging (Android (ASTC)):   C:/NVPACK/android-ndk-r12b/toolchains/arm-linux-androideabi-4.9/prebuilt/windows-x86_64/lib/gcc/arm-linux-androideabi/4.9.x/../../../../arm-linux-androideabi/bin\ld: error: D:/Unreal Engine 4/Windows/UnrealEngine/Engine/Plugins/2D/Paper2D/Binaries/Android/TESTGAME-Paper2D-armv7-es2.a(Module.Paper2D.gen.cpp-armv7-e
 s2.o): multiple definition of 'Z_Construct_UClass_UPaperSprite()'
 UATHelper: Packaging (Android (ASTC)):   C:/NVPACK/android-ndk-r12b/toolchains/arm-linux-androideabi-4.9/prebuilt/windows-x86_64/lib/gcc/arm-linux-androideabi/4.9.x/../../../../arm-linux-androideabi/bin\ld: D:/Unreal Engine 4/Windows/UnrealEngine/Engine/Plugins/2D/Paper2D/Binaries/Android/TESTGAME-Paper2D-armv7-es2.a(Paper2D.generated.cpp-armv7-es2.o): p
 revious definition here
 UATHelper: Packaging (Android (ASTC)):   C:/NVPACK/android-ndk-r12b/toolchains/arm-linux-androideabi-4.9/prebuilt/windows-x86_64/lib/gcc/arm-linux-androideabi/4.9.x/../../../../arm-linux-androideabi/bin\ld: error: D:/Unreal Engine 4/Windows/UnrealEngine/Engine/Plugins/2D/Paper2D/Binaries/Android/TESTGAME-Paper2D-armv7-es2.a(Module.Paper2D.gen.cpp-armv7-e
 s2.o): multiple definition of 'Z_Construct_UClass_UPaperTileMap()'
 UATHelper: Packaging (Android (ASTC)):   C:/NVPACK/android-ndk-r12b/toolchains/arm-linux-androideabi-4.9/prebuilt/windows-x86_64/lib/gcc/arm-linux-androideabi/4.9.x/../../../../arm-linux-androideabi/bin\ld: D:/Unreal Engine 4/Windows/UnrealEngine/Engine/Plugins/2D/Paper2D/Binaries/Android/TESTGAME-Paper2D-armv7-es2.a(Paper2D.generated.cpp-armv7-es2.o): p
 revious definition here
 ...
 ...
 ...
 UATHelper: Packaging (Android (ASTC)):   C:/NVPACK/android-ndk-r12b/toolchains/arm-linux-androideabi-4.9/prebuilt/windows-x86_64/lib/gcc/arm-linux-androideabi/4.9.x/../../../../arm-linux-androideabi/bin\ld: D:/Unreal Engine 4/Windows/UnrealEngine/Engine/Plugins/Runtime/PhysXVehicles/Binaries/Android/TESTGAME-PhysXVehicles-armv7-es2.a(PhysXVehicles.genera
 ted.cpp-armv7-es2.o): previous definition here
 UATHelper: Packaging (Android (ASTC)):   C:/NVPACK/android-ndk-r12b/toolchains/arm-linux-androideabi-4.9/prebuilt/windows-x86_64/lib/gcc/arm-linux-androideabi/4.9.x/../../../../arm-linux-androideabi/bin\ld: error: D:/Unreal Engine 4/Windows/UnrealEngine/Engine/Plugins/Runtime/PhysXVehicles/Binaries/Android/TESTGAME-PhysXVehicles-armv7-es2.a(Module.PhysXV
 ehicles.gen.cpp-armv7-es2.o): multiple definition of 'USimpleWheeledVehicleMovementComponent::USimpleWheeledVehicleMovementComponent(FVTableHelper&)'
 UATHelper: Packaging (Android (ASTC)):   C:/NVPACK/android-ndk-r12b/toolchains/arm-linux-androideabi-4.9/prebuilt/windows-x86_64/lib/gcc/arm-linux-androideabi/4.9.x/../../../../arm-linux-androideabi/bin\ld: D:/Unreal Engine 4/Windows/UnrealEngine/Engine/Plugins/Runtime/PhysXVehicles/Binaries/Android/TESTGAME-PhysXVehicles-armv7-es2.a(PhysXVehicles.genera
 ted.cpp-armv7-es2.o): previous definition here
 UATHelper: Packaging (Android (ASTC)):   C:/NVPACK/android-ndk-r12b/toolchains/arm-linux-androideabi-4.9/prebuilt/windows-x86_64/lib/gcc/arm-linux-androideabi/4.9.x/../../../../arm-linux-androideabi/bin\ld: error: D:/Unreal Engine 4/Windows/UnrealEngine/Engine/Plugins/Runtime/PhysXVehicles/Binaries/Android/TESTGAME-PhysXVehicles-armv7-es2.a(Module.PhysXV
 ehicles.gen.cpp-armv7-es2.o): multiple definition of 'USimpleWheeledVehicleMovementComponent::USimpleWheeledVehicleMovementComponent(FVTableHelper&)'
 PackagingResults: Error: D:/Unreal Engine 4/Windows/UnrealEngine/Engine/Plugins/Runtime/PhysXVehicles/Binaries/Android/TESTGAME-PhysXVehicles-armv7-es2.a(Module.PhysXVehicles.gen.cpp-armv7-es2.o): multiple definition of 'AWheeledVehicle::StaticRegisterNativesAWheeledVehicle()'
 PackagingResults: Error: D:/Unreal Engine 4/Windows/UnrealEngine/Engine/Plugins/Runtime/PhysXVehicles/Binaries/Android/TESTGAME-PhysXVehicles-armv7-es2.a(Module.PhysXVehicles.gen.cpp-armv7-es2.o): multiple definition of 'AWheeledVehicle::AWheeledVehicle(FVTableHelper&)'
 PackagingResults: Error: D:/Unreal Engine 4/Windows/UnrealEngine/Engine/Plugins/Runtime/PhysXVehicles/Binaries/Android/TESTGAME-PhysXVehicles-armv7-es2.a(Module.PhysXVehicles.gen.cpp-armv7-es2.o): multiple definition of 'AWheeledVehicle::AWheeledVehicle(FVTableHelper&)'
 PackagingResults: Error: D:/Unreal Engine 4/Windows/UnrealEngine/Engine/Plugins/Runtime/PhysXVehicles/Binaries/Android/TESTGAME-PhysXVehicles-armv7-es2.a(Module.PhysXVehicles.gen.cpp-armv7-es2.o): multiple definition of 'FVehicleGearData::StaticStruct()'
 PackagingResults: Error: D:/Unreal Engine 4/Windows/UnrealEngine/Engine/Plugins/Runtime/PhysXVehicles/Binaries/Android/TESTGAME-PhysXVehicles-armv7-es2.a(Module.PhysXVehicles.gen.cpp-armv7-es2.o): multiple definition of 'FVehicleInputRate::StaticStruct()'
 PackagingResults: Error: D:/Unreal Engine 4/Windows/UnrealEngine/Engine/Plugins/Runtime/PhysXVehicles/Binaries/Android/TESTGAME-PhysXVehicles-armv7-es2.a(Module.PhysXVehicles.gen.cpp-armv7-es2.o): multiple definition of 'FVehicleEngineData::StaticStruct()'
 PackagingResults: Error: D:/Unreal Engine 4/Windows/UnrealEngine/Engine/Plugins/Runtime/PhysXVehicles/Binaries/Android/TESTGAME-PhysXVehicles-armv7-es2.a(Module.PhysXVehicles.gen.cpp-armv7-es2.o): multiple definition of 'UVehicleAnimInstance::GetPrivateStaticClass()'
 PackagingResults: Error: D:/Unreal Engine 4/Windows/UnrealEngine/Engine/Plugins/Runtime/PhysXVehicles/Binaries/Android/TESTGAME-PhysXVehicles-armv7-es2.a(Module.PhysXVehicles.gen.cpp-armv7-es2.o): multiple definition of 'UVehicleAnimInstance::StaticRegisterNativesUVehicleAnimInstance()'
 PackagingResults: Error: D:/Unreal Engine 4/Windows/UnrealEngine/Engine/Plugins/Runtime/PhysXVehicles/Binaries/Android/TESTGAME-PhysXVehicles-armv7-es2.a(Module.PhysXVehicles.gen.cpp-armv7-es2.o): multiple definition of 'UVehicleAnimInstance::UVehicleAnimInstance(FVTableHelper&)'
 PackagingResults: Error: D:/Unreal Engine 4/Windows/UnrealEngine/Engine/Plugins/Runtime/PhysXVehicles/Binaries/Android/TESTGAME-PhysXVehicles-armv7-es2.a(Module.PhysXVehicles.gen.cpp-armv7-es2.o): multiple definition of 'UVehicleAnimInstance::UVehicleAnimInstance(FVTableHelper&)'
 PackagingResults: Error: D:/Unreal Engine 4/Windows/UnrealEngine/Engine/Plugins/Runtime/PhysXVehicles/Binaries/Android/TESTGAME-PhysXVehicles-armv7-es2.a(Module.PhysXVehicles.gen.cpp-armv7-es2.o): multiple definition of 'FAnimNode_WheelHandler::StaticStruct()'
 PackagingResults: Error: D:/Unreal Engine 4/Windows/UnrealEngine/Engine/Plugins/Runtime/PhysXVehicles/Binaries/Android/TESTGAME-PhysXVehicles-armv7-es2.a(Module.PhysXVehicles.gen.cpp-armv7-es2.o): multiple definition of 'FReplicatedVehicleState::StaticStruct()'
 PackagingResults: Error: D:/Unreal Engine 4/Windows/UnrealEngine/Engine/Plugins/Runtime/PhysXVehicles/Binaries/Android/TESTGAME-PhysXVehicles-armv7-es2.a(Module.PhysXVehicles.gen.cpp-armv7-es2.o): multiple definition of 'FVehicleTransmissionData::StaticStruct()'
 PackagingResults: Error: D:/Unreal Engine 4/Windows/UnrealEngine/Engine/Plugins/Runtime/PhysXVehicles/Binaries/Android/TESTGAME-PhysXVehicles-armv7-es2.a(Module.PhysXVehicles.gen.cpp-armv7-es2.o): multiple definition of 'FVehicleAnimInstanceProxy::StaticStruct()'
 PackagingResults: Error: D:/Unreal Engine 4/Windows/UnrealEngine/Engine/Plugins/Runtime/PhysXVehicles/Binaries/Android/TESTGAME-PhysXVehicles-armv7-es2.a(Module.PhysXVehicles.gen.cpp-armv7-es2.o): multiple definition of 'FVehicleDifferential4WData::StaticStruct()'
 PackagingResults: Error: D:/Unreal Engine 4/Windows/UnrealEngine/Engine/Plugins/Runtime/PhysXVehicles/Binaries/Android/TESTGAME-PhysXVehicles-armv7-es2.a(Module.PhysXVehicles.gen.cpp-armv7-es2.o): multiple definition of 'FTireConfigMaterialFriction::StaticStruct()'
 PackagingResults: Error: D:/Unreal Engine 4/Windows/UnrealEngine/Engine/Plugins/Runtime/PhysXVehicles/Binaries/Android/TESTGAME-PhysXVehicles-armv7-es2.a(Module.PhysXVehicles.gen.cpp-armv7-es2.o): multiple definition of 'UWheeledVehicleMovementComponent::ServerUpdateState(float, float, float, float, int)'
 PackagingResults: Error: D:/Unreal Engine 4/Windows/UnrealEngine/Engine/Plugins/Runtime/PhysXVehicles/Binaries/Android/TESTGAME-PhysXVehicles-armv7-es2.a(Module.PhysXVehicles.gen.cpp-armv7-es2.o): multiple definition of 'UWheeledVehicleMovementComponent::GetPrivateStaticClass()'
 PackagingResults: Error: D:/Unreal Engine 4/Windows/UnrealEngine/Engine/Plugins/Runtime/PhysXVehicles/Binaries/Android/TESTGAME-PhysXVehicles-armv7-es2.a(Module.PhysXVehicles.gen.cpp-armv7-es2.o): multiple definition of 'UWheeledVehicleMovementComponent::StaticRegisterNativesUWheeledVehicleMovementComponent()'
 PackagingResults: Error: D:/Unreal Engine 4/Windows/UnrealEngine/Engine/Plugins/Runtime/PhysXVehicles/Binaries/Android/TESTGAME-PhysXVehicles-armv7-es2.a(Module.PhysXVehicles.gen.cpp-armv7-es2.o): multiple definition of 'UWheeledVehicleMovementComponent::UWheeledVehicleMovementComponent(FVTableHelper&)'
 PackagingResults: Error: D:/Unreal Engine 4/Windows/UnrealEngine/Engine/Plugins/Runtime/PhysXVehicles/Binaries/Android/TESTGAME-PhysXVehicles-armv7-es2.a(Module.PhysXVehicles.gen.cpp-armv7-es2.o): multiple definition of 'UWheeledVehicleMovementComponent::UWheeledVehicleMovementComponent(FVTableHelper&)'
 PackagingResults: Error: D:/Unreal Engine 4/Windows/UnrealEngine/Engine/Plugins/Runtime/PhysXVehicles/Binaries/Android/TESTGAME-PhysXVehicles-armv7-es2.a(Module.PhysXVehicles.gen.cpp-armv7-es2.o): multiple definition of 'UWheeledVehicleMovementComponent4W::GetPrivateStaticClass()'
 PackagingResults: Error: D:/Unreal Engine 4/Windows/UnrealEngine/Engine/Plugins/Runtime/PhysXVehicles/Binaries/Android/TESTGAME-PhysXVehicles-armv7-es2.a(Module.PhysXVehicles.gen.cpp-armv7-es2.o): multiple definition of 'UWheeledVehicleMovementComponent4W::StaticRegisterNativesUWheeledVehicleMovementComponent4W()'
 PackagingResults: Error: D:/Unreal Engine 4/Windows/UnrealEngine/Engine/Plugins/Runtime/PhysXVehicles/Binaries/Android/TESTGAME-PhysXVehicles-armv7-es2.a(Module.PhysXVehicles.gen.cpp-armv7-es2.o): multiple definition of 'UWheeledVehicleMovementComponent4W::UWheeledVehicleMovementComponent4W(FVTableHelper&)'
 PackagingResults: Error: D:/Unreal Engine 4/Windows/UnrealEngine/Engine/Plugins/Runtime/PhysXVehicles/Binaries/Android/TESTGAME-PhysXVehicles-armv7-es2.a(Module.PhysXVehicles.gen.cpp-armv7-es2.o): multiple definition of 'UWheeledVehicleMovementComponent4W::UWheeledVehicleMovementComponent4W(FVTableHelper&)'
 PackagingResults: Error: D:/Unreal Engine 4/Windows/UnrealEngine/Engine/Plugins/Runtime/PhysXVehicles/Binaries/Android/TESTGAME-PhysXVehicles-armv7-es2.a(Module.PhysXVehicles.gen.cpp-armv7-es2.o): multiple definition of 'USimpleWheeledVehicleMovementComponent::GetPrivateStaticClass()'
 PackagingResults: Error: D:/Unreal Engine 4/Windows/UnrealEngine/Engine/Plugins/Runtime/PhysXVehicles/Binaries/Android/TESTGAME-PhysXVehicles-armv7-es2.a(Module.PhysXVehicles.gen.cpp-armv7-es2.o): multiple definition of 'USimpleWheeledVehicleMovementComponent::StaticRegisterNativesUSimpleWheeledVehicleMovementComponent()'
 PackagingResults: Error: D:/Unreal Engine 4/Windows/UnrealEngine/Engine/Plugins/Runtime/PhysXVehicles/Binaries/Android/TESTGAME-PhysXVehicles-armv7-es2.a(Module.PhysXVehicles.gen.cpp-armv7-es2.o): multiple definition of 'USimpleWheeledVehicleMovementComponent::USimpleWheeledVehicleMovementComponent(FVTableHelper&)'
 PackagingResults: Error: D:/Unreal Engine 4/Windows/UnrealEngine/Engine/Plugins/Runtime/PhysXVehicles/Binaries/Android/TESTGAME-PhysXVehicles-armv7-es2.a(Module.PhysXVehicles.gen.cpp-armv7-es2.o): multiple definition of 'USimpleWheeledVehicleMovementComponent::USimpleWheeledVehicleMovementComponent(FVTableHelper&)'
 UATHelper: Packaging (Android (ASTC)):   C:/NVPACK/android-ndk-r12b/toolchains/arm-linux-androideabi-4.9/prebuilt/windows-x86_64/lib/gcc/arm-linux-androideabi/4.9.x/../../../../arm-linux-androideabi/bin\ld: D:/Unreal Engine 4/Windows/UnrealEngine/Engine/Plugins/Runtime/PhysXVehicles/Binaries/Android/TESTGAME-PhysXVehicles-armv7-es2.a(PhysXVehicles.genera
 ted.cpp-armv7-es2.o): previous definition here
 UATHelper: Packaging (Android (ASTC)):   D:/Unreal Engine 4/Windows/UnrealEngine/Engine/Plugins/2D/Paper2D/Binaries/Android/TESTGAME-Paper2D-armv7-es2.a(Paper2D.generated.cpp-armv7-es2.o):D:/Unreal Engine 4/Windows/UnrealEngine/Engine/Plugins/2D/Paper2D/Intermediate/Build/Android/TESTGAME/Inc/Paper2D/Paper2D.generated.cpp:function Z_Construct_UClass_
 UMaterialExpressionSpriteTextureSampler_NoRegister(): error: undefined reference to 'GetPrivateStaticClassBody(wchar_t const*, wchar_t const*, UClass*&, void (*)(), unsigned int, unsigned int, unsigned long long, wchar_t const*, void (*)(FObjectInitializer const&), UObject* (*)(FVTableHelper&), void (*)(UObject*, FReferenceCollector&), UClass* (*)(), UClass*
  (*)(), bool)'
 UATHelper: Packaging (Android (ASTC)):   D:/Unreal Engine 4/Windows/UnrealEngine/Engine/Plugins/2D/Paper2D/Binaries/Android/TESTGAME-Paper2D-armv7-es2.a(Paper2D.generated.cpp-armv7-es2.o):D:/Unreal Engine 4/Windows/UnrealEngine/Engine/Plugins/2D/Paper2D/Intermediate/Build/Android/TESTGAME/Inc/Paper2D/Paper2D.generated.cpp:function UMaterialExpression
 SpriteTextureSampler::StaticClass(): error: undefined reference to 'GetPrivateStaticClassBody(wchar_t const*, wchar_t const*, UClass*&, void (*)(), unsigned int, unsigned int, unsigned long long, wchar_t const*, void (*)(FObjectInitializer const&), UObject* (*)(FVTableHelper&), void (*)(UObject*, FReferenceCollector&), UClass* (*)(), UClass* (*)(), bool)'
 UATHelper: Packaging (Android (ASTC)):   D:/Unreal Engine 4/Windows/UnrealEngine/Engine/Plugins/2D/Paper2D/Binaries/Android/TESTGAME-Paper2D-armv7-es2.a(Paper2D.generated.cpp-armv7-es2.o):D:/Unreal Engine 4/Windows/UnrealEngine/Engine/Plugins/2D/Paper2D/Intermediate/Build/Android/TESTGAME/Inc/Paper2D/Paper2D.generated.cpp:function Z_Construct_UClass_
 UMaterialExpressionSpriteTextureSampler(): error: undefined reference to 'GetPrivateStaticClassBody(wchar_t const*, wchar_t const*, UClass*&, void (*)(), unsigned int, unsigned int, unsigned long long, wchar_t const*, void (*)(FObjectInitializer const&), UObject* (*)(FVTableHelper&), void (*)(UObject*, FReferenceCollector&), UClass* (*)(), UClass* (*)(), boo
 l)'
 UATHelper: Packaging (Android (ASTC)):   D:/Unreal Engine 4/Windows/UnrealEngine/Engine/Plugins/2D/Paper2D/Binaries/Android/TESTGAME-Paper2D-armv7-es2.a(Paper2D.generated.cpp-armv7-es2.o):D:/Unreal Engine 4/Windows/UnrealEngine/Engine/Plugins/2D/Paper2D/Intermediate/Build/Android/TESTGAME/Inc/Paper2D/Paper2D.generated.cpp:function Z_Construct_UClass_
 UMaterialExpressionSpriteTextureSampler(): error: undefined reference to 'FDebug::LogAssertFailedMessage(char const*, char const*, int, wchar_t const*, ...)'
 UATHelper: Packaging (Android (ASTC)):   D:/Unreal Engine 4/Windows/UnrealEngine/Engine/Plugins/2D/Paper2D/Binaries/Android/TESTGAME-Paper2D-armv7-es2.a(Paper2D.generated.cpp-armv7-es2.o):D:/Unreal Engine 4/Windows/UnrealEngine/Engine/Plugins/2D/Paper2D/Intermediate/Build/Android/TESTGAME/Inc/Paper2D/Paper2D.generated.cpp:function UMaterialExpression
 SpriteTextureSampler::GetPrivateStaticClass(): error: undefined reference to 'GetPrivateStaticClassBody(wchar_t const*, wchar_t const*, UClass*&, void (*)(), unsigned int, unsigned int, unsigned long long, wchar_t const*, void (*)(FObjectInitializer const&), UObject* (*)(FVTableHelper&), void (*)(UObject*, FReferenceCollector&), UClass* (*)(), UClass* (*)(),
  bool)'
 UATHelper: Packaging (Android (ASTC)):   D:/Unreal Engine 4/Windows/UnrealEngine/Engine/Plugins/2D/Paper2D/Binaries/Android/TESTGAME-Paper2D-armv7-es2.a(Paper2D.generated.cpp-armv7-es2.o):D:/Unreal Engine 4/Windows/UnrealEngine/Engine/Plugins/2D/Paper2D/Intermediate/Build/Android/TESTGAME/Inc/Paper2D/Paper2D.generated.cpp:function Z_Construct_UClass_
 APaperCharacter(): error: undefined reference to 'FDebug::LogAssertFailedMessage(char const*, char const*, int, wchar_t const*, ...)'
 PackagingResults: Error: undefined reference to 'GetPrivateStaticClassBody(wchar_t const*, wchar_t const*, UClass*&, void (*)(), unsigned int, unsigned int, unsigned long long, wchar_t const*, void (*)(FObjectInitializer const&), UObject* (*)(FVTableHelper&), void (*)(UObject*, FReferenceCollector&), UClass* (*)(), UClass* (*)(), bool)'
 PackagingResults: Error: undefined reference to 'GetPrivateStaticClassBody(wchar_t const*, wchar_t const*, UClass*&, void (*)(), unsigned int, unsigned int, unsigned long long, wchar_t const*, void (*)(FObjectInitializer const&), UObject* (*)(FVTableHelper&), void (*)(UObject*, FReferenceCollector&), UClass* (*)(), UClass* (*)(), bool)'
 PackagingResults: Error: undefined reference to 'GetPrivateStaticClassBody(wchar_t const*, wchar_t const*, UClass*&, void (*)(), unsigned int, unsigned int, unsigned long long, wchar_t const*, void (*)(FObjectInitializer const&), UObject* (*)(FVTableHelper&), void (*)(UObject*, FReferenceCollector&), UClass* (*)(), UClass* (*)(), bool)'
 PackagingResults: Error: undefined reference to 'FDebug::LogAssertFailedMessage(char const*, char const*, int, wchar_t const*, ...)'
 PackagingResults: Error: undefined reference to 'GetPrivateStaticClassBody(wchar_t const*, wchar_t const*, UClass*&, void (*)(), unsigned int, unsigned int, unsigned long long, wchar_t const*, void (*)(FObjectInitializer const&), UObject* (*)(FVTableHelper&), void (*)(UObject*, FReferenceCollector&), UClass* (*)(), UClass* (*)(), bool)'
 PackagingResults: Error: undefined reference to 'FDebug::LogAssertFailedMessage(char const*, char const*, int, wchar_t const*, ...)'
 UATHelper: Packaging (Android (ASTC)):   D:/Unreal Engine 4/Windows/UnrealEngine/Engine/Plugins/2D/Paper2D/Binaries/Android/TESTGAME-Paper2D-armv7-es2.a(Paper2D.generated.cpp-armv7-es2.o):D:/Unreal Engine 4/Windows/UnrealEngine/Engine/Plugins/2D/Paper2D/Intermediate/Build/Android/TESTGAME/Inc/Paper2D/Paper2D.generated.cpp:function UPaperFlipbook::Sta
 ticRegisterNativesUPaperFlipbook(): error: undefined reference to 'FNativeFunctionRegistrar::RegisterFunctions(UClass*, TNameNativePtrPair<char> const*, int)'
 UATHelper: Packaging (Android (ASTC)):   D:/Unreal Engine 4/Windows/UnrealEngine/Engine/Plugins/2D/Paper2D/Binaries/Android/TESTGAME-Paper2D-armv7-es2.a(Paper2D.generated.cpp-armv7-es2.o):D:/Unreal Engine 4/Windows/UnrealEngine/Engine/Plugins/2D/Paper2D/Intermediate/Build/Android/TESTGAME/Inc/Paper2D/Paper2D.generated.cpp:function Z_Construct_UFuncti
 on_UPaperFlipbook_GetKeyFrameIndexAtTime(): error: undefined reference to 'UFunction::UFunction(FObjectInitializer const&, UFunction*, unsigned int, unsigned short, unsigned int)'
 UATHelper: Packaging (Android (ASTC)):   D:/Unreal Engine 4/Windows/UnrealEngine/Engine/Plugins/2D/Paper2D/Binaries/Android/TESTGAME-Paper2D-armv7-es2.a(Paper2D.generated.cpp-armv7-es2.o):D:/Unreal Engine 4/Windows/UnrealEngine/Engine/Plugins/2D/Paper2D/Intermediate/Build/Android/TESTGAME/Inc/Paper2D/Paper2D.generated.cpp:function Z_Construct_UClass_
 UPaperFlipbook(): error: undefined reference to 'FDebug::LogAssertFailedMessage(char const*, char const*, int, wchar_t const*, ...)'
 PackagingResults: Error: undefined reference to 'FNativeFunctionRegistrar::RegisterFunctions(UClass*, TNameNativePtrPair<char> const*, int)'
 UATHelper: Packaging (Android (ASTC)):   D:/Unreal Engine 4/Windows/UnrealEngine/Engine/Plugins/2D/Paper2D/Binaries/Android/TESTGAME-Paper2D-armv7-es2.a(Paper2D.generated.cpp-armv7-es2.o):D:/Unreal Engine 4/Windows/UnrealEngine/Engine/Plugins/2D/Paper2D/Intermediate/Build/Android/TESTGAME/Inc/Paper2D/Paper2D.generated.cpp:function Z_Construct_UFuncti
 on_UPaperFlipbook_GetNumFrames(): error: undefined reference to 'UFunction::UFunction(FObjectInitializer const&, UFunction*, unsigned int, unsigned short, unsigned int)'
 UATHelper: Packaging (Android (ASTC)):   D:/Unreal Engine 4/Windows/UnrealEngine/Engine/Plugins/2D/Paper2D/Binaries/Android/TESTGAME-Paper2D-armv7-es2.a(Paper2D.generated.cpp-armv7-es2.o):D:/Unreal Engine 4/Windows/UnrealEngine/Engine/Plugins/2D/Paper2D/Intermediate/Build/Android/TESTGAME/Inc/Paper2D/Paper2D.generated.cpp:function Z_Construct_UFuncti
 on_UPaperFlipbook_GetNumKeyFrames(): error: undefined reference to 'UFunction::UFunction(FObjectInitializer const&, UFunction*, unsigned int, unsigned short, unsigned int)'
 PackagingResults: Error: undefined reference to 'UFunction::UFunction(FObjectInitializer const&, UFunction*, unsigned int, unsigned short, unsigned int)'
 UATHelper: Packaging (Android (ASTC)):   D:/Unreal Engine 4/Windows/UnrealEngine/Engine/Plugins/2D/Paper2D/Binaries/Android/TESTGAME-Paper2D-armv7-es2.a(Paper2D.generated.cpp-armv7-es2.o):D:/Unreal Engine 4/Windows/UnrealEngine/Engine/Plugins/2D/Paper2D/Intermediate/Build/Android/TESTGAME/Inc/Paper2D/Paper2D.generated.cpp:function Z_Construct_UFuncti
 on_UPaperFlipbook_GetSpriteAtFrame(): error: undefined reference to 'UFunction::UFunction(FObjectInitializer const&, UFunction*, unsigned int, unsigned short, unsigned int)'
 UATHelper: Packaging (Android (ASTC)):   D:/Unreal Engine 4/Windows/UnrealEngine/Engine/Plugins/2D/Paper2D/Binaries/Android/TESTGAME-Paper2D-armv7-es2.a(Paper2D.generated.cpp-armv7-es2.o):D:/Unreal Engine 4/Windows/UnrealEngine/Engine/Plugins/2D/Paper2D/Intermediate/Build/Android/TESTGAME/Inc/Paper2D/Paper2D.generated.cpp:function Z_Construct_UClass_
 APaperFlipbookActor(): error: undefined reference to 'FDebug::LogAssertFailedMessage(char const*, char const*, int, wchar_t const*, ...)'
 UATHelper: Packaging (Android (ASTC)):   D:/Unreal Engine 4/Windows/UnrealEngine/Engine/Plugins/2D/Paper2D/Binaries/Android/TESTGAME-Paper2D-armv7-es2.a(Paper2D.generated.cpp-armv7-es2.o):D:/Unreal Engine 4/Windows/UnrealEngine/Engine/Plugins/2D/Paper2D/Intermediate/Build/Android/TESTGAME/Inc/Paper2D/Paper2D.generated.cpp:function Z_Construct_UDelega
 teFunction_Paper2D_FlipbookFinishedPlaySignature__DelegateSignature(): error: undefined reference to 'UDelegateFunction::UDelegateFunction(FObjectInitializer const&, UFunction*, unsigned int, unsigned short, unsigned int)'
 PackagingResults: Error: undefined reference to 'FDebug::LogAssertFailedMessage(char const*, char const*, int, wchar_t const*, ...)'
 PackagingResults: Error: undefined reference to 'UFunction::UFunction(FObjectInitializer const&, UFunction*, unsigned int, unsigned short, unsigned int)'
 PackagingResults: Error: undefined reference to 'UFunction::UFunction(FObjectInitializer const&, UFunction*, unsigned int, unsigned short, unsigned int)'
 PackagingResults: Error: undefined reference to 'UFunction::UFunction(FObjectInitializer const&, UFunction*, unsigned int, unsigned short, unsigned int)'
 PackagingResults: Error: undefined reference to 'FDebug::LogAssertFailedMessage(char const*, char const*, int, wchar_t const*, ...)'
 PackagingResults: Error: undefined reference to 'UDelegateFunction::UDelegateFunction(FObjectInitializer const&, UFunction*, unsigned int, unsigned short, unsigned int)'
 UATHelper: Packaging (Android (ASTC)):   D:/Unreal Engine 4/Windows/UnrealEngine/Engine/Plugins/2D/Paper2D/Binaries/Android/TESTGAME-Paper2D-armv7-es2.a(Paper2D.generated.cpp-armv7-es2.o):D:/Unreal Engine 4/Windows/UnrealEngine/Engine/Plugins/2D/Paper2D/Intermediate/Build/Android/TESTGAME/Inc/Paper2D/Paper2D.generated.cpp:function UPaperFlipbookCompo
 nent::StaticRegisterNativesUPaperFlipbookComponent(): error: undefined reference to 'FNativeFunctionRegistrar::RegisterFunctions(UClass*, TNameNativePtrPair<char> const*, int)'
 UATHelper: Packaging (Android (ASTC)):   D:/Unreal Engine 4/Windows/UnrealEngine/Engine/Plugins/2D/Paper2D/Binaries/Android/TESTGAME-Paper2D-armv7-es2.a(Paper2D.generated.cpp-armv7-es2.o):D:/Unreal Engine 4/Windows/UnrealEngine/Engine/Plugins/2D/Paper2D/Intermediate/Build/Android/TESTGAME/Inc/Paper2D/Paper2D.generated.cpp:function UPaperFlipbookCompo
 nent::execGetSpriteMaterial(FFrame&, void*): error: undefined reference to 'UPaperFlipbookComponent::GetSpriteMaterial() const'
 UATHelper: Packaging (Android (ASTC)):   D:/Unreal Engine 4/Windows/UnrealEngine/Engine/Plugins/2D/Paper2D/Binaries/Android/TESTGAME-Paper2D-armv7-es2.a(Paper2D.generated.cpp-armv7-es2.o):D:/Unreal Engine 4/Windows/UnrealEngine/Engine/Plugins/2D/Paper2D/Intermediate/Build/Android/TESTGAME/Inc/Paper2D/Paper2D.generated.cpp:function UPaperGroupedSprite
 Component::StaticRegisterNativesUPaperGroupedSpriteComponent(): error: undefined reference to 'FNativeFunctionRegistrar::RegisterFunctions(UClass*, TNameNativePtrPair<char> const*, int)'
 UATHelper: Packaging (Android (ASTC)):   D:/Unreal Engine 4/Windows/UnrealEngine/Engine/Plugins/2D/Paper2D/Binaries/Android/TESTGAME-Paper2D-armv7-es2.a(Paper2D.generated.cpp-armv7-es2.o):D:/Unreal Engine 4/Windows/UnrealEngine/Engine/Plugins/2D/Paper2D/Intermediate/Build/Android/TESTGAME/Inc/Paper2D/Paper2D.generated.cpp:function Z_Construct_UScript
 Struct_FPaperSpriteAtlasSlot(): error: undefined reference to 'UAssetObjectProperty::GetPrivateStaticClass()'
 UATHelper: Packaging (Android (ASTC)):   D:/Unreal Engine 4/Windows/UnrealEngine/Engine/Plugins/2D/Paper2D/Binaries/Android/TESTGAME-Paper2D-armv7-es2.a(Paper2D.generated.cpp-armv7-es2.o):D:/Unreal Engine 4/Windows/UnrealEngine/Engine/Plugins/2D/Paper2D/Intermediate/Build/Android/TESTGAME/Inc/Paper2D/Paper2D.generated.cpp:function Z_Construct_UScript
 Struct_FPaperSpriteAtlasSlot(): error: undefined reference to 'vtable for UAssetObjectProperty'
 UATHelper: Packaging (Android (ASTC)):   C:/NVPACK/android-ndk-r12b/toolchains/arm-linux-androideabi-4.9/prebuilt/windows-x86_64/lib/gcc/arm-linux-androideabi/4.9.x/../../../../arm-linux-androideabi/bin\ld: the vtable symbol may be undefined because the class is missing its key function (see go/missingkeymethod)
 UATHelper: Packaging (Android (ASTC)):   D:/Unreal Engine 4/Windows/UnrealEngine/Engine/Plugins/2D/Paper2D/Binaries/Android/TESTGAME-Paper2D-armv7-es2.a(Paper2D.generated.cpp-armv7-es2.o):D:/Unreal Engine 4/Windows/UnrealEngine/Engine/Plugins/2D/Paper2D/Intermediate/Build/Android/TESTGAME/Inc/Paper2D/Paper2D.generated.cpp:function UPaperSpriteBluepri
 ntLibrary::StaticRegisterNativesUPaperSpriteBlueprintLibrary(): error: undefined reference to 'FNativeFunctionRegistrar::RegisterFunctions(UClass*, TNameNativePtrPair<char> const*, int)'
 UATHelper: Packaging (Android (ASTC)):   D:/Unreal Engine 4/Windows/UnrealEngine/Engine/Plugins/2D/Paper2D/Binaries/Android/TESTGAME-Paper2D-armv7-es2.a(Paper2D.generated.cpp-armv7-es2.o):D:/Unreal Engine 4/Windows/UnrealEngine/Engine/Plugins/2D/Paper2D/Intermediate/Build/Android/TESTGAME/Inc/Paper2D/Paper2D.generated.cpp:function Z_Construct_UClass_
 UPaperTileMap(): error: undefined reference to 'UAssetObjectProperty::GetPrivateStaticClass()'
 UATHelper: Packaging (Android (ASTC)):   D:/Unreal Engine 4/Windows/UnrealEngine/Engine/Plugins/2D/Paper2D/Binaries/Android/TESTGAME-Paper2D-armv7-es2.a(Paper2D.generated.cpp-armv7-es2.o):D:/Unreal Engine 4/Windows/UnrealEngine/Engine/Plugins/2D/Paper2D/Intermediate/Build/Android/TESTGAME/Inc/Paper2D/Paper2D.generated.cpp:function Z_Construct_UClass_
 UPaperTileMap(): error: undefined reference to 'vtable for UAssetObjectProperty'
 UATHelper: Packaging (Android (ASTC)):   C:/NVPACK/android-ndk-r12b/toolchains/arm-linux-androideabi-4.9/prebuilt/windows-x86_64/lib/gcc/arm-linux-androideabi/4.9.x/../../../../arm-linux-androideabi/bin\ld: the vtable symbol may be undefined because the class is missing its key function (see go/missingkeymethod)
 PackagingResults: Error: undefined reference to 'FNativeFunctionRegistrar::RegisterFunctions(UClass*, TNameNativePtrPair<char> const*, int)'
 PackagingResults: Error: undefined reference to 'UPaperFlipbookComponent::GetSpriteMaterial() const'
 PackagingResults: Error: undefined reference to 'FNativeFunctionRegistrar::RegisterFunctions(UClass*, TNameNativePtrPair<char> const*, int)'
 PackagingResults: Error: undefined reference to 'UAssetObjectProperty::GetPrivateStaticClass()'
 PackagingResults: Error: undefined reference to 'vtable for UAssetObjectProperty'
 PackagingResults: Error: undefined reference to 'FNativeFunctionRegistrar::RegisterFunctions(UClass*, TNameNativePtrPair<char> const*, int)'
 PackagingResults: Error: undefined reference to 'UAssetObjectProperty::GetPrivateStaticClass()'
 PackagingResults: Error: undefined reference to 'vtable for UAssetObjectProperty'
 UATHelper: Packaging (Android (ASTC)):   D:/Unreal Engine 4/Windows/UnrealEngine/Engine/Plugins/2D/Paper2D/Binaries/Android/TESTGAME-Paper2D-armv7-es2.a(Paper2D.generated.cpp-armv7-es2.o):D:/Unreal Engine 4/Windows/UnrealEngine/Engine/Plugins/2D/Paper2D/Intermediate/Build/Android/TESTGAME/Inc/Paper2D/Paper2D.generated.cpp:function UPaperTileMap::UPap
 erTileMap(FVTableHelper&): error: undefined reference to 'FStringAssetReference::SetPath(FString)'
 UATHelper: Packaging (Android (ASTC)):   D:/Unreal Engine 4/Windows/UnrealEngine/Engine/Plugins/2D/Paper2D/Binaries/Android/TESTGAME-Paper2D-armv7-es2.a(Paper2D.generated.cpp-armv7-es2.o):D:/Unreal Engine 4/Windows/UnrealEngine/Engine/Plugins/2D/Paper2D/Intermediate/Build/Android/TESTGAME/Inc/Paper2D/Paper2D.generated.cpp:function void TProperty_Nume
 ric<int>::ConvertFromInt<long long>(FArchive&, void*, FPropertyTag const&): error: undefined reference to 'FString::Printf(wchar_t const*, ...)'
 UATHelper: Packaging (Android (ASTC)):   D:/Unreal Engine 4/Windows/UnrealEngine/Engine/Plugins/2D/Paper2D/Binaries/Android/TESTGAME-Paper2D-armv7-es2.a(Paper2D.generated.cpp-armv7-es2.o):D:/Unreal Engine 4/Windows/UnrealEngine/Engine/Plugins/2D/Paper2D/Intermediate/Build/Android/TESTGAME/Inc/Paper2D/Paper2D.generated.cpp:function void TProperty_Nume
 ric<int>::ConvertFromInt<long long>(FArchive&, void*, FPropertyTag const&): error: undefined reference to 'FString::Printf(wchar_t const*, ...)'
 UATHelper: Packaging (Android (ASTC)):   D:/Unreal Engine 4/Windows/UnrealEngine/Engine/Plugins/2D/Paper2D/Binaries/Android/TESTGAME-Paper2D-armv7-es2.a(Paper2D.generated.cpp-armv7-es2.o):D:/Unreal Engine 4/Windows/UnrealEngine/Engine/Plugins/2D/Paper2D/Intermediate/Build/Android/TESTGAME/Inc/Paper2D/Paper2D.generated.cpp:function void TProperty_Nume
 ric<int>::ConvertFromInt<long long>(FArchive&, void*, FPropertyTag const&): error: undefined reference to 'FMsg::Logf_Internal(char const*, int, FName const&, ELogVerbosity::Type, wchar_t const*, ...)'
 UATHelper: Packaging (Android (ASTC)):   D:/Unreal Engine 4/Windows/UnrealEngine/Engine/Plugins/2D/Paper2D/Binaries/Android/TESTGAME-Paper2D-armv7-es2.a(Paper2D.generated.cpp-armv7-es2.o):D:/Unreal Engine 4/Windows/UnrealEngine/Engine/Plugins/2D/Paper2D/Intermediate/Build/Android/TESTGAME/Inc/Paper2D/Paper2D.generated.cpp:function void TProperty_Nume
 ric<int>::ConvertFromInt<unsigned long long>(FArchive&, void*, FPropertyTag const&): error: undefined reference to 'FString::Printf(wchar_t const*, ...)'
 UATHelper: Packaging (Android (ASTC)):   D:/Unreal Engine 4/Windows/UnrealEngine/Engine/Plugins/2D/Paper2D/Binaries/Android/TESTGAME-Paper2D-armv7-es2.a(Paper2D.generated.cpp-armv7-es2.o):D:/Unreal Engine 4/Windows/UnrealEngine/Engine/Plugins/2D/Paper2D/Intermediate/Build/Android/TESTGAME/Inc/Paper2D/Paper2D.generated.cpp:function void TProperty_Nume
 ric<int>::ConvertFromInt<unsigned long long>(FArchive&, void*, FPropertyTag const&): error: undefined reference to 'FString::Printf(wchar_t const*, ...)'
 UATHelper: Packaging (Android (ASTC)):   D:/Unreal Engine 4/Windows/UnrealEngine/Engine/Plugins/2D/Paper2D/Binaries/Android/TESTGAME-Paper2D-armv7-es2.a(Paper2D.generated.cpp-armv7-es2.o):D:/Unreal Engine 4/Windows/UnrealEngine/Engine/Plugins/2D/Paper2D/Intermediate/Build/Android/TESTGAME/Inc/Paper2D/Paper2D.generated.cpp:function void TProperty_Nume
 ric<int>::ConvertFromInt<unsigned long long>(FArchive&, void*, FPropertyTag const&): error: undefined reference to 'FMsg::Logf_Internal(char const*, int, FName const&, ELogVerbosity::Type, wchar_t const*, ...)'
 UATHelper: Packaging (Android (ASTC)):   D:/Unreal Engine 4/Windows/UnrealEngine/Engine/Plugins/2D/Paper2D/Binaries/Android/TESTGAME-Paper2D-armv7-es2.a(Paper2D.generated.cpp-armv7-es2.o):D:/Unreal Engine 4/Windows/UnrealEngine/Engine/Plugins/2D/Paper2D/Intermediate/Build/Android/TESTGAME/Inc/Paper2D/Paper2D.generated.cpp:function UScriptStruct::TCpp
 StructOps<FPaperSpriteAtlasSlot>::Construct(void*): error: undefined reference to 'FStringAssetReference::SetPath(FString)'
 UATHelper: Packaging (Android (ASTC)):   D:/Unreal Engine 4/Windows/UnrealEngine/Engine/Plugins/2D/Paper2D/Binaries/Android/TESTGAME-Paper2D-armv7-es2.a(Paper2D.generated.cpp-armv7-es2.o):D:/Unreal Engine 4/Windows/UnrealEngine/Engine/Plugins/2D/Paper2D/Intermediate/Build/Android/TESTGAME/Inc/Paper2D/Paper2D.generated.cpp:function UScriptStruct::TCpp
 StructOps<FPaperSpriteAtlasSlot>::Copy(void*, void const*, int): error: undefined reference to 'FStringAssetReference::operator=(FStringAssetReference const&)'
 PackagingResults: Error: undefined reference to 'FStringAssetReference::SetPath(FString)'
 PackagingResults: Error: undefined reference to 'FString::Printf(wchar_t const*, ...)'
 PackagingResults: Error: undefined reference to 'FString::Printf(wchar_t const*, ...)'
 PackagingResults: Error: undefined reference to 'FMsg::Logf_Internal(char const*, int, FName const&, ELogVerbosity::Type, wchar_t const*, ...)'
 PackagingResults: Error: undefined reference to 'FString::Printf(wchar_t const*, ...)'
 PackagingResults: Error: undefined reference to 'FString::Printf(wchar_t const*, ...)'
 PackagingResults: Error: undefined reference to 'FMsg::Logf_Internal(char const*, int, FName const&, ELogVerbosity::Type, wchar_t const*, ...)'
 PackagingResults: Error: undefined reference to 'FStringAssetReference::SetPath(FString)'
 PackagingResults: Error: undefined reference to 'FStringAssetReference::operator=(FStringAssetReference const&)'
 UATHelper: Packaging (Android (ASTC)):   D:/Unreal Engine 4/Windows/UnrealEngine/Engine/Plugins/2D/Paper2D/Binaries/Android/TESTGAME-Paper2D-armv7-es2.a(Paper2D.generated.cpp-armv7-es2.o):D:/Unreal Engine 4/Windows/UnrealEngine/Engine/Plugins/2D/Paper2D/Intermediate/Build/Android/TESTGAME/Inc/Paper2D/Paper2D.generated.cpp:vtable for UPaperSpriteBluep
 rintLibrary: error: undefined reference to 'UObject::CheckDefaultSubobjectsInternal()'
 UATHelper: Packaging (Android (ASTC)):   D:/Unreal Engine 4/Windows/UnrealEngine/Engine/Plugins/2D/Paper2D/Binaries/Android/TESTGAME-Paper2D-armv7-es2.a(Paper2D.generated.cpp-armv7-es2.o):D:/Unreal Engine 4/Windows/UnrealEngine/Engine/Plugins/2D/Paper2D/Intermediate/Build/Android/TESTGAME/Inc/Paper2D/Paper2D.generated.cpp:vtable for UTileMapBlueprint
 Library: error: undefined reference to 'UObject::CheckDefaultSubobjectsInternal()'
 UATHelper: Packaging (Android (ASTC)):   D:/Unreal Engine 4/Windows/UnrealEngine/Engine/Plugins/Blendables/LightPropagationVolume/Binaries/Android/TESTGAME-LightPropagationVolumeRuntime-armv7-es2.a(Module.LightPropagationVolumeRuntime.cpp-armv7-es2.o):D:/Unreal Engine 4/Windows/UnrealEngine/Engine/Plugins/Blendables/LightPropagationVolume/Intermediate/Bu
 ild/Android/TESTGAME/Development/LightPropagationVolumeRuntime/Module.LightPropagationVolumeRuntime.cpp:vtable for ULightPropagationVolumeBlendable: error: undefined reference to 'UObject::CheckDefaultSubobjectsInternal()'
 UATHelper: Packaging (Android (ASTC)):   D:/Unreal Engine 4/Windows/UnrealEngine/Engine/Plugins/Messaging/TcpMessaging/Binaries/Android/TESTGAME-TcpMessaging-armv7-es2.a(TcpMessaging.generated.cpp-armv7-es2.o):D:/Unreal Engine 4/Windows/UnrealEngine/Engine/Plugins/Messaging/TcpMessaging/Intermediate/Build/Android/TESTGAME/Inc/TcpMessaging/TcpMessagin
 g.generated.cpp:function void InternalConstructor<UTcpMessagingSettings>(FObjectInitializer const&): error: undefined reference to 'UTcpMessagingSettings::UTcpMessagingSettings(FObjectInitializer const&)'
 UATHelper: Packaging (Android (ASTC)):   D:/Unreal Engine 4/Windows/UnrealEngine/Engine/Plugins/Messaging/TcpMessaging/Binaries/Android/TESTGAME-TcpMessaging-armv7-es2.a(TcpMessaging.generated.cpp-armv7-es2.o):D:/Unreal Engine 4/Windows/UnrealEngine/Engine/Plugins/Messaging/TcpMessaging/Intermediate/Build/Android/TESTGAME/Inc/TcpMessaging/TcpMessagin
 g.generated.cpp:vtable for UTcpMessagingSettings: error: undefined reference to 'UObject::CheckDefaultSubobjectsInternal()'
 UATHelper: Packaging (Android (ASTC)):   D:/Unreal Engine 4/Windows/UnrealEngine/Engine/Plugins/Runtime/AndroidPermission/Binaries/Android/TESTGAME-AndroidPermission-armv7-es2.a(AndroidPermission.generated.cpp-armv7-es2.o):D:/Unreal Engine 4/Windows/UnrealEngine/Engine/Plugins/Runtime/AndroidPermission/Intermediate/Build/Android/TESTGAME/Inc/AndroidP
 ermission/AndroidPermission.generated.cpp:function Z_Construct_UDelegateFunction_AndroidPermission_AndroidPermissionDynamicDelegate__DelegateSignature(): error: undefined reference to 'UDelegateFunction::UDelegateFunction(FObjectInitializer const&, UFunction*, unsigned int, unsigned short, unsigned int)'
 PackagingResults: Error: undefined reference to 'UObject::CheckDefaultSubobjectsInternal()'
 UATHelper: Packaging (Android (ASTC)):   D:/Unreal Engine 4/Windows/UnrealEngine/Engine/Plugins/Online/OnlineSubsystemUtils/Binaries/Android/TESTGAME-OnlineSubsystemUtils-armv7-es2.a(OnlineSubsystemUtils.generated.cpp-armv7-es2.o):D:/Unreal Engine 4/Windows/UnrealEngine/Engine/Plugins/Online/OnlineSubsystemUtils/Intermediate/Build/Android/TESTGAME/In
 c/OnlineSubsystemUtils/OnlineSubsystemUtils.generated.cpp:function Z_Construct_UDelegateFunction_OnlineSubsystemUtils_AchievementWriteDelegate__DelegateSignature(): error: undefined reference to 'UDelegateFunction::UDelegateFunction(FObjectInitializer const&, UFunction*, unsigned int, unsigned short, unsigned int)'
 UATHelper: Packaging (Android (ASTC)):   D:/Unreal Engine 4/Windows/UnrealEngine/Engine/Plugins/Online/OnlineSubsystemUtils/Binaries/Android/TESTGAME-OnlineSubsystemUtils-armv7-es2.a(OnlineSubsystemUtils.generated.cpp-armv7-es2.o):D:/Unreal Engine 4/Windows/UnrealEngine/Engine/Plugins/Online/OnlineSubsystemUtils/Intermediate/Build/Android/TESTGAME/In
 c/OnlineSubsystemUtils/OnlineSubsystemUtils.generated.cpp:function Z_Construct_UDelegateFunction_OnlineSubsystemUtils_OnlineConnectionResult__DelegateSignature(): error: undefined reference to 'UDelegateFunction::UDelegateFunction(FObjectInitializer const&, UFunction*, unsigned int, unsigned short, unsigned int)'
 PackagingResults: Error: undefined reference to 'UObject::CheckDefaultSubobjectsInternal()'
 PackagingResults: Error: undefined reference to 'UObject::CheckDefaultSubobjectsInternal()'
 PackagingResults: Error: undefined reference to 'UTcpMessagingSettings::UTcpMessagingSettings(FObjectInitializer const&)'
 PackagingResults: Error: undefined reference to 'UObject::CheckDefaultSubobjectsInternal()'
 PackagingResults: Error: undefined reference to 'UDelegateFunction::UDelegateFunction(FObjectInitializer const&, UFunction*, unsigned int, unsigned short, unsigned int)'
 PackagingResults: Error: undefined reference to 'UDelegateFunction::UDelegateFunction(FObjectInitializer const&, UFunction*, unsigned int, unsigned short, unsigned int)'
 PackagingResults: Error: undefined reference to 'UDelegateFunction::UDelegateFunction(FObjectInitializer const&, UFunction*, unsigned int, unsigned short, unsigned int)'
 UATHelper: Packaging (Android (ASTC)):   D:/Unreal Engine 4/Windows/UnrealEngine/Engine/Plugins/Online/OnlineSubsystemUtils/Binaries/Android/TESTGAME-OnlineSubsystemUtils-armv7-es2.a(OnlineSubsystemUtils.generated.cpp-armv7-es2.o):D:/Unreal Engine 4/Windows/UnrealEngine/Engine/Plugins/Online/OnlineSubsystemUtils/Intermediate/Build/Android/TESTGAME/In
 c/OnlineSubsystemUtils/OnlineSubsystemUtils.generated.cpp:function void TProperty_Numeric<unsigned int>::ConvertFromInt<signed char>(FArchive&, void*, FPropertyTag const&): error: undefined reference to 'FMsg::Logf_Internal(char const*, int, FName const&, ELogVerbosity::Type, wchar_t const*, ...)'
 UATHelper: Packaging (Android (ASTC)):   D:/Unreal Engine 4/Windows/UnrealEngine/Engine/Plugins/Online/OnlineSubsystemUtils/Binaries/Android/TESTGAME-OnlineSubsystemUtils-armv7-es2.a(OnlineSubsystemUtils.generated.cpp-armv7-es2.o):D:/Unreal Engine 4/Windows/UnrealEngine/Engine/Plugins/Online/OnlineSubsystemUtils/Intermediate/Build/Android/TESTGAME/In
 c/OnlineSubsystemUtils/OnlineSubsystemUtils.generated.cpp:function void TProperty_Numeric<unsigned int>::ConvertFromInt<short>(FArchive&, void*, FPropertyTag const&): error: undefined reference to 'FMsg::Logf_Internal(char const*, int, FName const&, ELogVerbosity::Type, wchar_t const*, ...)'
 PackagingResults: Error: undefined reference to 'FMsg::Logf_Internal(char const*, int, FName const&, ELogVerbosity::Type, wchar_t const*, ...)'
 PackagingResults: Error: undefined reference to 'FMsg::Logf_Internal(char const*, int, FName const&, ELogVerbosity::Type, wchar_t const*, ...)'
 UATHelper: Packaging (Android (ASTC)):   clang++.exe: error: linker command failed with exit code 1 (use -v to see invocation)
 PackagingResults: Error: linker command failed with exit code 1 (use -v to see invocation)
 UATHelper: Packaging (Android (ASTC)):   ERROR: UBT ERROR: Failed to produce item: D:\GameProjects\TESTGAME\Binaries\Android\TESTGAME-armv7-es2.so
 PackagingResults: Error: UBT ERROR: Failed to produce item: D:\GameProjects\TESTGAME\Binaries\Android\TESTGAME-armv7-es2.so
 UATHelper: Packaging (Android (ASTC)):   Total build time: 2596.33 seconds (Local executor: 0.00 seconds)
 UATHelper: Packaging (Android (ASTC)): Took 2596.6476907s to run UnrealBuildTool.exe, ExitCode=5
 UATHelper: Packaging (Android (ASTC)): ERROR: Command failed (Result:5): D:\Unreal Engine 4\Windows\UnrealEngine\Engine\Binaries\DotNET\UnrealBuildTool.exe TESTGAME Android Development -Project=D:\GameProjects\TESTGAME\TESTGAME.uproject  D:\GameProjects\TESTGAME\TESTGAME.uproject -NoUBTMakefiles  -remoteini="D:\GameProjects\TESTGAME" 
 -skipdeploy -noxge -NoHotReload -ignorejunk. See logfile for details: 'UnrealBuildTool-2018.05.13-20.22.30.txt' 
 UATHelper: Packaging (Android (ASTC)):        (see D:\Unreal Engine 4\Windows\UnrealEngine\Engine\Programs\AutomationTool\Saved\Logs\UAT_Log.txt for full exception trace)
 PackagingResults: Error: Command failed (Result:5): D:\Unreal Engine 4\Windows\UnrealEngine\Engine\Binaries\DotNET\UnrealBuildTool.exe TESTGAME Android Development -Project=D:\GameProjects\TESTGAME\TESTGAME.uproject  D:\GameProjects\TESTGAME\TESTGAME.uproject -NoUBTMakefiles  -remoteini="D:\GameProjects\TESTGAME" -skipdeploy -noxge -N
 oHotReload -ignorejunk. See logfile for details: 'UnrealBuildTool-2018.05.13-20.22.30.txt' 
 UATHelper: Packaging (Android (ASTC)): AutomationTool exiting with ExitCode=5 (5)
 UATHelper: Packaging (Android (ASTC)): BUILD FAILED
 PackagingResults: Error: Unknown Error
Product Version: UE 4.19
Tags:
more ▼

asked May 13 '18 at 03:55 PM in Packaging & Deployment

avatar image

Monu29
41 1 4 7

avatar image Maddius Jun 04 '18 at 05:33 PM

I have the same issue, did you find a solution?

avatar image Monu29 Jun 06 '18 at 01:19 PM

You also building/packaging with UE4.19.2 GitHub version ?

avatar image Maddius Jun 04 '18 at 09:38 PM

Looks like for me it was just some bad intermediate state, full rebuild sorted it.

avatar image Monu29 Jun 06 '18 at 01:18 PM

I tried full rebuild by deleting Intermediate, Build and DataDerivedCache directories. But still packaging fails. However packaging same project with Binary release of UE 4.19.2 is successful.

(comments are locked)
10|2000 characters needed characters left

0 answers: sort voted first
Be the first one to answer this question
toggle preview:

Up to 5 attachments (including images) can be used with a maximum of 5.2 MB each and 5.2 MB total.

Follow this question

Once you sign in you will be able to subscribe for any updates here

Answers to this question