x

Search in
Sort by:

Question Status:

Search help

  • Simple searches use one or more words. Separate the words with spaces (cat dog) to search cat,dog or both. Separate the words with plus signs (cat +dog) to search for items that may contain cat but must contain dog.
  • You can further refine your search on the search results page, where you can search by keywords, author, topic. These can be combined with each other. Examples
    • cat dog --matches anything with cat,dog or both
    • cat +dog --searches for cat +dog where dog is a mandatory term
    • cat -dog -- searches for cat excluding any result containing dog
    • [cats] —will restrict your search to results with topic named "cats"
    • [cats] [dogs] —will restrict your search to results with both topics, "cats", and "dogs"

Cant compile engine

 ShaderCompileWorker
 Build started Thu 16.08.18 1:08:55 AM.
 Target Build:
   Creating makefile for ShaderCompileWorker (no existing makefile)
 Performing full C++ include scan (no include cache file)
 Using Visual Studio 2017 14.14.26428 toolchain (C:\Program Files (x86)\Microsoft Visual Studio\2017\Community\VC\Tools\MSVC\14.14.26428) and Windows 10.0.17134.0 SDK (C:\Program Files (x86)\Windows Kits\10).
 Building UnrealHeaderTool...
 Distributing 40 actions to XGE
 Fatal Error: An IncrediBuild distributed job cannot be started from within another distributed job.
 ERROR: UBT ERROR: Failed to produce item: C:\UnrealEngine\Engine\Intermediate\Build\Win64\UnrealHeaderTool\Development\Core\UnrealHeaderTool-Core.lib
        (see ..\Programs\UnrealBuildTool\Log_UHT.txt for full exception trace)
 Total build time: 0.28 seconds (XGE executor: 0.00 seconds)
 Error: UnrealHeaderTool failed for target 'ShaderCompileWorker' (platform: Win64, module info: C:\UnrealEngine\Engine\Intermediate\Build\Win64\ShaderCompileWorker\Development\ShaderCompileWorker.uhtmanifest, exit code: OtherCompilationError (5)).
   C:\Program Files (x86)\Microsoft Visual Studio\2017\Community\Common7\IDE\VC\VCTargets\Microsoft.MakeFile.Targets(44,5): error MSB3075: The command "..\..\Build\BatchFiles\Build.bat ShaderCompileWorker Win64 Development -WaitMutex -FromMsBuild" exited with code 5. Please verify that you have sufficient rights to run this command.
 Done building target "Build" in project "ShaderCompileWorker.vcxproj" -- FAILED.
 
 Done building project "ShaderCompileWorker.vcxproj" -- FAILED.
 
 Build FAILED.
 
 C:\Program Files (x86)\Microsoft Visual Studio\2017\Community\Common7\IDE\VC\VCTargets\Microsoft.MakeFile.Targets(44,5): error MSB3075: The command "..\..\Build\BatchFiles\Build.bat ShaderCompileWorker Win64 Development -WaitMutex -FromMsBuild" exited with code 5. Please verify that you have sufficient rights to run this command.
     0 Warning(s)
     1 Error(s)
 
 Time Elapsed 00:00:01.58
 
Product Version: UE 4.20
Tags:
more ▼

asked Aug 15 '18 at 09:11 PM in Installation & Setup

avatar image

VashTheBrutal
33 5 8 10

(comments are locked)
10|2000 characters needed characters left
Viewable by all users

1 answer: sort voted first

It should work out of the box if you use the VS interface to build and let UnrealBuildTool call incredibuild. just dont use incredibuild to build ue4, that wont work because ubt calls incredibuild already.

more ▼

answered Aug 15 '18 at 09:21 PM

avatar image

VashTheBrutal
33 5 8 10

(comments are locked)
10|2000 characters needed characters left
Viewable by all users
Your answer
toggle preview:

Up to 5 attachments (including images) can be used with a maximum of 5.2 MB each and 5.2 MB total.

Follow this question

Once you sign in you will be able to subscribe for any updates here

Answers to this question