x

Search in
Sort by:

Question Status:

Search help

  • Simple searches use one or more words. Separate the words with spaces (cat dog) to search cat,dog or both. Separate the words with plus signs (cat +dog) to search for items that may contain cat but must contain dog.
  • You can further refine your search on the search results page, where you can search by keywords, author, topic. These can be combined with each other. Examples
    • cat dog --matches anything with cat,dog or both
    • cat +dog --searches for cat +dog where dog is a mandatory term
    • cat -dog -- searches for cat excluding any result containing dog
    • [cats] —will restrict your search to results with topic named "cats"
    • [cats] [dogs] —will restrict your search to results with both topics, "cats", and "dogs"

Failed to produce item: libUE4Editor-UnrealEd.so

I ran into this problem after executing "./Setup.sh && ./GenerateProjectFiles.sh && make". Does anyone know how to solve this issue?

 PLEASE ATTACH THE FOLLOWING FILES TO THE BUG REPORT:
 Preprocessed source(s) and associated run script(s) are located at:
 clang: note: diagnostic msg: /tmp/Module-69ed1e.cpp
 clang: note: diagnostic msg: /tmp/Module-69ed1e.sh
 clang: note: diagnostic msg: 
 
 ********************
 clang: note: diagnostic msg: 
 ********************
 
 PLEASE ATTACH THE FOLLOWING FILES TO THE BUG REPORT:
 Preprocessed source(s) and associated run script(s) are located at:
 clang: note: diagnostic msg: /tmp/Module-bc7408.cpp
 clang: note: diagnostic msg: /tmp/Module-bc7408.sh
 clang: note: diagnostic msg: 
 
 ********************
 clang: note: diagnostic msg: 
 ********************
 
 PLEASE ATTACH THE FOLLOWING FILES TO THE BUG REPORT:
 Preprocessed source(s) and associated run script(s) are located at:
 clang: note: diagnostic msg: /tmp/Module-bf1d76.cpp
 clang: note: diagnostic msg: /tmp/Module-bf1d76.sh
 clang: note: diagnostic msg: 
 
 ********************
 clang: note: diagnostic msg: 
 ********************
 
 PLEASE ATTACH THE FOLLOWING FILES TO THE BUG REPORT:
 Preprocessed source(s) and associated run script(s) are located at:
 clang: note: diagnostic msg: /tmp/Module-13cbe9.cpp
 clang: note: diagnostic msg: /tmp/Module-13cbe9.sh
 clang: note: diagnostic msg: 
 
 ********************
 clang: error: unable to execute command: Segmentation fault (core dumped)
 clang: error: clang frontend command failed due to signal (use -v to see invocation)
 clang version 4.0.0-1ubuntu1~16.04.2 (tags/RELEASE_400/rc1)
 Target: x86_64-pc-linux-gnu
 Thread model: posix
 InstalledDir: /usr/bin
 clang: note: diagnostic msg: PLEASE submit a bug report to http://llvm.org/bugs/ and include the crash backtrace, preprocessed source, and associated run script.
 clang: note: diagnostic msg: 
 ********************
 
 PLEASE ATTACH THE FOLLOWING FILES TO THE BUG REPORT:
 Preprocessed source(s) and associated run script(s) are located at:
 clang: note: diagnostic msg: /tmp/Module-9a7876.cpp
 clang: note: diagnostic msg: /tmp/Module-9a7876.sh
 clang: note: diagnostic msg: 
 
 ********************
 clang: note: diagnostic msg: 
 ********************
 
 PLEASE ATTACH THE FOLLOWING FILES TO THE BUG REPORT:
 Preprocessed source(s) and associated run script(s) are located at:
 clang: note: diagnostic msg: /tmp/Module-48a698.cpp
 clang: note: diagnostic msg: /tmp/Module-48a698.sh
 clang: note: diagnostic msg: 
 
 ********************
 clang: note: diagnostic msg: 
 ********************
 
 PLEASE ATTACH THE FOLLOWING FILES TO THE BUG REPORT:
 Preprocessed source(s) and associated run script(s) are located at:
 clang: note: diagnostic msg: /tmp/Module-b4ca6f.cpp
 clang: note: diagnostic msg: /tmp/Module-b4ca6f.sh
 clang: note: diagnostic msg: 
 
 ********************
 clang: note: diagnostic msg: 
 ********************
 
 PLEASE ATTACH THE FOLLOWING FILES TO THE BUG REPORT:
 Preprocessed source(s) and associated run script(s) are located at:
 clang: note: diagnostic msg: /tmp/Module-6a72e5.cpp
 clang: note: diagnostic msg: /tmp/Module-6a72e5.sh
 clang: note: diagnostic msg: 
 
 ********************
 ERROR: UBT ERROR: Failed to produce item: /home/UnrealEngine_4.19/Engine/Binaries/Linux/libUE4Editor-UnrealEd.so
 Total build time: 103.95 seconds (Local executor: 0.00 seconds)
 Makefile:188: recipe for target 'UE4Editor' failed
 make: *** [UE4Editor] Error 5
 


Product Version: UE 4.19
Tags:
more ▼

asked Oct 26 '18 at 03:58 AM in Installation & Setup

avatar image

pnsn123
1 2

avatar image 007100dedalao May 13 '19 at 04:52 AM

I have the same question. Have you solved your problem?

(comments are locked)
10|2000 characters needed characters left
Viewable by all users

0 answers: sort voted first
Be the first one to answer this question
toggle preview:

Up to 5 attachments (including images) can be used with a maximum of 5.2 MB each and 5.2 MB total.

Follow this question

Once you sign in you will be able to subscribe for any updates here

Answers to this question