x

Search in
Sort by:

Question Status:

Search help

  • Simple searches use one or more words. Separate the words with spaces (cat dog) to search cat,dog or both. Separate the words with plus signs (cat +dog) to search for items that may contain cat but must contain dog.
  • You can further refine your search on the search results page, where you can search by keywords, author, topic. These can be combined with each other. Examples
    • cat dog --matches anything with cat,dog or both
    • cat +dog --searches for cat +dog where dog is a mandatory term
    • cat -dog -- searches for cat excluding any result containing dog
    • [cats] —will restrict your search to results with topic named "cats"
    • [cats] [dogs] —will restrict your search to results with both topics, "cats", and "dogs"

Packaging Error

I'm getting an error packaging a level. The part that gets me is I don't know what the error means or what it implies me to do to fix it. Wondering if you guys have any pointers? I'm seeing words 'LoadedWorld' So I'm guessing that has something to do with the level streaming...
link text
link text

UATHelper: Packaging (Windows (64-bit)): LogWindows: Error: begin: stack for UAT
UATHelper: Packaging (Windows (64-bit)): LogWindows: Error: === Critical error: ===
UATHelper: Packaging (Windows (64-bit)): LogWindows: Error:
UATHelper: Packaging (Windows (64-bit)): LogWindows: Error: Assertion failed: LoadedWorld [File:D:\UE4VR4.18B\Engine\Source\Runtime\Engine\Private\LevelActor.cpp] [Line: 1173]
UATHelper: Packaging (Windows (64-bit)): LogWindows: Error:
UATHelper: Packaging (Windows (64-bit)): LogWindows: Error:
UATHelper: Packaging (Windows (64-bit)): LogWindows: Error:
UATHelper: Packaging (Windows (64-bit)): LogWindows: Error: [Callstack] 0x00000000E2B1A388 KERNELBASE.dll!UnknownFunction []
UATHelper: Packaging (Windows (64-bit)): LogWindows: Error: [Callstack] 0x00000000BC7776D4 UE4Editor-ApplicationCore.dll!FWindowsErrorOutputDevice::Serialize()
[d:\ue4vr4.18b\engine\source\runtime\applicationcore\private\windows\windowserroroutputdevice.cpp:65]
UATHelper: Packaging (Windows (64-bit)): LogWindows: Error: [Callstack] 0x000000007D605E8B UE4Editor-Core.dll!FOutputDevice::Logf_VA() [d:\ue4vr4.18b\engine\source\runtime\core\private\misc\outputdevice.cpp:70]
UATHelper: Packaging (Windows (64-bit)): LogWindows: Error: [Callstack] 0x000000007D596279 UE4Editor-Core.dll!FDebug::AssertFailed() [d:\ue4vr4.18b\engine\source\runtime\core\private\misc\assertionmacros.cpp:414]
UATHelper: Packaging (Windows (64-bit)): LogWindows: Error: [Callstack] 0x000000007A6D5BAF UE4Editor-Engine.dll!UWorld::LoadSecondaryLevels() [d:\ue4vr4.18b\engine\source\runtime\engine\private\levelactor.cpp:1175]
UATHelper: Packaging (Windows (64-bit)): LogWindows: Error: [Callstack] 0x00000000786B8FBC UE4Editor-UnrealEd.dll!UCookOnTheFlyServer::PostLoadPackageFixup() [d:\ue4vr4.18b\engine\source\editor\unrealed\private\cookontheflyserver.cpp:2424]
UATHelper: Packaging (Windows (64-bit)): LogWindows: Error: [Callstack] 0x000000007868B018 UE4Editor-UnrealEd.dll!UCookOnTheFlyServer::GetAllUnsolicitedPackages() [d:\ue4vr4.18b\engine\source\editor\unrealed\private\cookontheflyserver.cpp:2054]
UATHelper: Packaging (Windows (64-bit)): LogWindows: Error: [Callstack] 0x00000000786D9A78 UE4Editor-UnrealEd.dll!UCookOnTheFlyServer::TickCookOnTheSide() [d:\ue4vr4.18b\engine\source\editor\unrealed\private\cookontheflyserver.cpp:1736]
UATHelper: Packaging (Windows (64-bit)): LogWindows: Error: [Callstack] 0x0000000078567E21 UE4Editor-UnrealEd.dll!UCookCommandlet::CookByTheBook() [d:\ue4vr4.18b\engine\source\editor\unrealed\private\commandlets\cookcommandlet.cpp:902]
UATHelper: Packaging (Windows (64-bit)): LogWindows: Error: [Callstack] 0x000000007858F451 UE4Editor-UnrealEd.dll!UCookCommandlet::Main() [d:\ue4vr4.18b\engine\source\editor\unrealed\private\commandlets\cookcommandlet.cpp:583]
UATHelper: Packaging (Windows (64-bit)): LogWindows: Error: [Callstack] 0x00000000F19BD25F UE4Editor-Cmd.exe!FEngineLoop::PreInit() [d:\ue4vr4.18b\engine\source\runtime\launch\private\launchengineloop.cpp:2167]
UATHelper: Packaging (Windows (64-bit)): LogWindows: Error: [Callstack] 0x00000000F19B525A UE4Editor-Cmd.exe!GuardedMain() [d:\ue4vr4.18b\engine\source\runtime\launch\private\launch.cpp:127]
UATHelper: Packaging (Windows (64-bit)): LogWindows: Error: [Callstack] 0x00000000F19B54AA UE4Editor-Cmd.exe!GuardedMainWrapper() [d:\ue4vr4.18b\engine\source\runtime\launch\private\windows\launchwindows.cpp:134]
UATHelper: Packaging (Windows (64-bit)): LogWindows: Error: [Callstack] 0x00000000F19C2379 UE4Editor-Cmd.exe!WinMain() [d:\ue4vr4.18b\engine\source\runtime\launch\private\windows\launchwindows.cpp:210]
UATHelper: Packaging (Windows (64-bit)): LogWindows: Error: [Callstack] 0x00000000F19C3193 UE4Editor-Cmd.exe!
_scrt_common_main_seh() [f:\dd\vctools\crt\vcstartup\src\startup\exe_common.inl:253]
UATHelper: Packaging (Windows (64-bit)): LogWindows: Error: [Callstack] 0x00000000E50A3034 KERNEL32.DLL!UnknownFunction []
UATHelper: Packaging (Windows (64-bit)): LogWindows: Error: [Callstack] 0x00000000E5B51461 ntdll.dll!UnknownFunction []
UATHelper: Packaging (Windows (64-bit)): LogWindows: Error: [Callstack] 0x00000000E5B51461 ntdll.dll!UnknownFunction []
UATHelper: Packaging (Windows (64-bit)): LogWindows: Error:
UATHelper: Packaging (Windows (64-bit)): LogWindows: Error: end: stack for UAT
UATHelper: Packaging (Windows (64-bit)): Took 375.3881744s to run UE4Editor-Cmd.exe, ExitCode=3
UATHelper: Packaging (Windows (64-bit)): Cook failed. Deleting cooked data.
UATHelper: Packaging (Windows (64-bit)): ERROR: Cook failed.
UATHelper: Packaging (Windows (64-bit)): (see D:\UE4VR4.18B\Engine\Programs\AutomationTool\Saved\Logs\UAT_Log.txt for full exception trace)
UATHelper: Packaging (Windows (64-bit)): AutomationTool exiting with ExitCode=25 (Error_UnknownCookFailure)
UATHelper: Packaging (Windows (64-bit)): Error while unloading appdomain. (Exception from HRESULT: 0x80131015)
UATHelper: Packaging (Windows (64-bit)): at System.AppDomain.Unload(AppDomain domain)
UATHelper: Packaging (Windows (64-bit)): at AutomationToolLauncher.Launcher.Main() in D:\UE4VR4.18B\Engine\Source\Programs\AutomationToolLauncher\Launcher.cs:line 32
UATHelper: Packaging (Windows (64-bit)): BUILD FAILED
PackagingResults: Error: Unknown Cook Failure

Product Version: UE 4.18
Tags:
uat-log.txt (613.8 kB)
more ▼

asked Nov 01 '18 at 03:01 AM in Packaging & Deployment

avatar image

pdcsky
19 8 8 11

avatar image pdcsky Nov 06 '18 at 05:29 AM

I'm officially lost on this one, the errors are giving me very little to work with. It's like telling me that an error stops the packaging but the error isn't clear on how to fix it... Would love to have some help on this one...

avatar image pdcsky Nov 11 '18 at 11:07 PM

I'm going to try packaging each level individually. See if I can find the culprit that way. There's a total of 10 levels, so I'll do one at a time and hopefully that'll narrow it down.

avatar image pdcsky Nov 22 '18 at 05:57 AM

alt text

One of the main errors starts with this:

UATHelper: Packaging (Windows (64-bit)): error: function 'GetModifiedWConfigurationView' redefined
UATHelper: Packaging (Windows (64-bit)): error: function 'VRProjMapViewRectToRenderTargetInternal' redefined

avatar image thatguy999 Nov 22 '18 at 06:44 AM

yea i got one of those 2 but cant make a thread

it actually told me i needed visual studio installed when its already installed. i made a blank project nothing included and packaged and ran it just fine. then opened the same project and activated the web browser plugin and packaging failed. this is a old issue i noticed google had many reports of this. it wont even work on windows 7 which is just insane. google shows things from 2016 on the subject... its almost 2019

this is why people leave unreal and go back to unity. if i wanted broken stuff theres just more of it with unity. the unreal market could be closed and nobody would ever notice. you better pray every one never grows sick of fortnight and the lack of revenue forces you to fix things. laugh but companies are evaluated by growth. nowhere to go but down now . if your in a decline cycle its just another icarus story

the only reason i complain is i had to install microsoft visual studio. but now that i started i will spread that stupid fortnight dance vid clip all over the place relabeled as other things with different thumbnails and a caption that reads fortnight dance party. thats right im going to rickroll people with those stupid kids dancing. you wont have any users old enough to pay for anything after i post it as a response vid across youtube. thats right some one made some stupid recipe bam those dumb kids dancing as a response . some one is playing something else idc heres that stupid vid with a new thumbnail. i got a number of gmail accounts and no job. never underestimate what 1 guy with nothing but time can do. im uninstalling unreal good day

avatar image pdcsky Nov 22 '18 at 11:24 PM


So after a little investigating, I found I had a few experimental features turned on in the Project Settings
These are things like Vulkan support

Another big issue was unable to cook and save packages because the file directory was too long, so I relocated the project to a place where it wasn't so long.

I managed to get those out of the way. The first critical error that I'm lost on is now about
Assertion failed: LoadedWorld [File:D:\UE4VR4.18\Engine\Source\Runtime\Engine\Private\LevelActor.cpp]

Does this mean an actor in the level is the cause of all this? alt text

(comments are locked)
10|2000 characters needed characters left

0 answers: sort voted first
Be the first one to answer this question
toggle preview:

Up to 5 attachments (including images) can be used with a maximum of 5.2 MB each and 5.2 MB total.

Follow this question

Once you sign in you will be able to subscribe for any updates here

Answers to this question