x

Search in
Sort by:

Question Status:

Search help

  • Simple searches use one or more words. Separate the words with spaces (cat dog) to search cat,dog or both. Separate the words with plus signs (cat +dog) to search for items that may contain cat but must contain dog.
  • You can further refine your search on the search results page, where you can search by keywords, author, topic. These can be combined with each other. Examples
    • cat dog --matches anything with cat,dog or both
    • cat +dog --searches for cat +dog where dog is a mandatory term
    • cat -dog -- searches for cat excluding any result containing dog
    • [cats] —will restrict your search to results with topic named "cats"
    • [cats] [dogs] —will restrict your search to results with both topics, "cats", and "dogs"

4.19 build fails - UnrealBuiltTool.Rules error

I'm getting an error: The namespace "UnrealBuildTool.Rules" already contains a definition for 'LeapMotion'

Here's the list of red lined errors, maybe there's yet more here of concern:

UATHelper: Packaging (Windows (64-bit)): ERROR: c:\Program Files\Epic Games\UE_4.19\Engine\Plugins\Runtime\LeapMotion\Source\LeapMotion\LeapMotion.Build.cs(7,15) : error CS0101: The namespace 'UnrealBuildTool.Rules' already contains a definition for 'LeapMotion' UATHelper: Packaging (Windows (64-bit)): ERROR: Unable to compile source files. PackagingResults: Error: c:\Program Files\Epic Games\UE_4.19\Engine\Plugins\Runtime\LeapMotion\Source\LeapMotion\LeapMotion.Build.cs(7,15) : error CS0101: The namespace 'UnrealBuildTool.Rules' already contains a definition for 'LeapMotion' PackagingResults: Error: Unable to compile source files. UATHelper: Packaging (Windows (64-bit)): Took 3.9888268s to run UnrealBuildTool.exe, ExitCode=5 UATHelper: Packaging (Windows (64-bit)): ERROR: Command failed (Result:5): C:\Program Files\Epic Games\UE_4.19\Engine\Binaries\DotNET\UnrealBuildTool.exe EAA_EduFishFix Win64 Development -Project="D:\EAA_Edu 4.19\EAA_EduFishFix.uproject" "D:\EAA_Edu 4.19\EAA_EduFishFix.uproject" -NoUBTMakefiles -remoteini="D:\EAA_Edu 4.19" -skipdeploy -noxge -generatemanif est -NoHotReload. See logfile for details: 'UnrealBuildTool-2019.03.13-16.28.24.txt' UATHelper: Packaging (Windows (64-bit)): (see C:\Users\Benjy's Boxx\AppData\Roaming\Unreal Engine\AutomationTool\Logs\C+Program+Files+Epic+Games+UE_4.19\UAT_Log.txt for full exception trace) PackagingResults: Error: Command failed (Result:5): C:\Program Files\Epic Games\UE_4.19\Engine\Binaries\DotNET\UnrealBuildTool.exe EAA_EduFishFix Win64 Development -Project="D:\EAA_Edu 4.19\EAA_EduFishFix.uproject" "D:\EAA_Edu 4.19\EAA_EduFishFix.uproject" -NoUBTMakefiles -remoteini="D:\EAA_Edu 4.19" -skipdeploy -noxge -generatemanifest -NoHotReload. See l ogfile for details: 'UnrealBuildTool-2019.03.13-16.28.24.txt' UATHelper: Packaging (Windows (64-bit)): AutomationTool exiting with ExitCode=5 (5) UATHelper: Packaging (Windows (64-bit)): BUILD FAILED PackagingResults: Error: Unknown Error

Thanks for advice!

Product Version: UE 4.19
Tags:
more ▼

asked Mar 13 '19 at 08:36 PM in Packaging & Deployment

avatar image

BenjvC
65 3 9 12

(comments are locked)
10|2000 characters needed characters left
Viewable by all users

0 answers: sort voted first
Be the first one to answer this question
toggle preview:

Up to 5 attachments (including images) can be used with a maximum of 5.2 MB each and 5.2 MB total.

Follow this question

Once you sign in you will be able to subscribe for any updates here

Answers to this question