x

Search in
Sort by:

Question Status:

Search help

  • Simple searches use one or more words. Separate the words with spaces (cat dog) to search cat,dog or both. Separate the words with plus signs (cat +dog) to search for items that may contain cat but must contain dog.
  • You can further refine your search on the search results page, where you can search by keywords, author, topic. These can be combined with each other. Examples
    • cat dog --matches anything with cat,dog or both
    • cat +dog --searches for cat +dog where dog is a mandatory term
    • cat -dog -- searches for cat excluding any result containing dog
    • [cats] —will restrict your search to results with topic named "cats"
    • [cats] [dogs] —will restrict your search to results with both topics, "cats", and "dogs"

Office Holiday

Epic Games' offices will be on holiday from June 22nd to July 7th. During this period support will be limited. Our offices will reopen on Monday, July 8th. 

rsync error when packaging for iOS

I've been having this error since a while, and no matter what i do, i just cannot seem to fix it. i'm ALWAYS Getting this error:

UATHelper: Packaging (iOS): rsync error: error in rsync protocol data stream (code 12) at /home/lapo/packaging/rsync-3.0.4-1/src/rsync-3.0.4/io.c(632) [sender=3.0.4]

here's the error in the log:

 UATHelper: Packaging (iOS):     rsync error: error in rsync protocol data stream (code 12) at /home/lapo/packaging/rsync-3.0.4-1/src/rsync-3.0.4/io.c(632) [sender=3.0.4]
 PackagingResults: Error: error in rsync protocol data stream (code 12) at /home/lapo/packaging/rsync-3.0.4-1/src/rsync-3.0.4/io.c(632) [sender=3.0.4]
 UATHelper: Packaging (iOS):   ERROR: Error while running Rsync (exit code 12)
 UATHelper: Packaging (iOS):          (see C:\Users\nicho\AppData\Roaming\Unreal Engine\AutomationTool\Logs\F+Program+Files+(x64)+Epic+Games+UE_4.21\UBT-ancalagon-IOS-Development.txt for full exception trace)
 PackagingResults: Error: Error while running Rsync (exit code 12)
 UATHelper: Packaging (iOS): Took 2.0194507s to run UnrealBuildTool.exe, ExitCode=5
 UATHelper: Packaging (iOS): ERROR: UnrealBuildTool failed. See log for more details. (C:\Users\nicho\AppData\Roaming\Unreal Engine\AutomationTool\Logs\F+Program+Files+(x64)+Epic+Games+UE_4.21\UBT-ancalagon-IOS-Development.txt)
 UATHelper: Packaging (iOS):        (see C:\Users\nicho\AppData\Roaming\Unreal Engine\AutomationTool\Logs\F+Program+Files+(x64)+Epic+Games+UE_4.21\Log.txt for full exception trace)
 PackagingResults: Error: UnrealBuildTool failed. See log for more details. (C:\Users\nicho\AppData\Roaming\Unreal Engine\AutomationTool\Logs\F+Program+Files+(x64)+Epic+Games+UE_4.21\UBT-ancalagon-IOS-Development.txt)
 UATHelper: Packaging (iOS): AutomationTool exiting with ExitCode=5 (5)
 UATHelper: Packaging (iOS): BUILD FAILED
 PackagingResults: Error: Unknown Error

Is anybody else able to package to iOS? cause it's definitely not working for me.

Product Version: UE 4.21
Tags:
more ▼

asked Mar 25 '19 at 02:13 AM in Packaging & Deployment

avatar image

gotgrassct
222 48 62 78

avatar image Woji Jun 08 '19 at 10:29 PM

I have that same issue on 4.22

In the log I am seeing RemoteMac.RsyncOutput: ssh: Could not resolve hostname "mac name": no address with associated name

(comments are locked)
10|2000 characters needed characters left
Viewable by all users

0 answers: sort voted first
Be the first one to answer this question
toggle preview:

Up to 5 attachments (including images) can be used with a maximum of 5.2 MB each and 5.2 MB total.

Follow this question

Once you sign in you will be able to subscribe for any updates here

Answers to this question