x

Search in
Sort by:

Question Status:

Search help

  • Simple searches use one or more words. Separate the words with spaces (cat dog) to search cat,dog or both. Separate the words with plus signs (cat +dog) to search for items that may contain cat but must contain dog.
  • You can further refine your search on the search results page, where you can search by keywords, author, topic. These can be combined with each other. Examples
    • cat dog --matches anything with cat,dog or both
    • cat +dog --searches for cat +dog where dog is a mandatory term
    • cat -dog -- searches for cat excluding any result containing dog
    • [cats] —will restrict your search to results with topic named "cats"
    • [cats] [dogs] —will restrict your search to results with both topics, "cats", and "dogs"

Questions in topic: error building

1
answer
Votes: 0 Views: 4

Why am i getting an Error: Error Launch Failed when I package for android. RESOLVED

Section: Packaging & Deployment
Product Version: UE 4.15
Answer 6 days ago
0
answers
Votes: 0 Views: 12

Unkown error when packaging

Section: Packaging & Deployment
Product Version: UE 4.15
Question May 12 '17 at 11:37 AM
3
answers
Votes: 0 Views: 197

Can't open project - "Try rebuilding from source manually"

Section: Using UE4
Product Version: UE 4.13
Answer May 06 '17 at 11:58 PM
2
answers
Votes: 0 Views: 31

Game no longer build for Android. RESOLVED

Section: Packaging & Deployment
Product Version: UE 4.15
Answer Apr 30 '17 at 02:54 PM
1
answer
Votes: 0 Views: 16

Swarm Agent [ERROR]

Section: Rendering
Product Version: Not Selected
Comment Apr 27 '17 at 02:24 PM
0
answers
Votes: 0 Views: 72

Error 0xc000007b

Section: Using UE4
Product Version: UE 4.15
Question Apr 26 '17 at 11:05 AM
1
answer
Votes: 0 Views: 210

Packaging fails in 4.13 RESOLVED

Section: Packaging & Deployment
Product Version: UE 4.13
Comment Apr 21 '17 at 09:40 AM
0
answers
Votes: 0 Views: 40

Can't build project in VS2015

Section: C++ Programming
Product Version: UE 4.14
Question Apr 17 '17 at 11:57 PM
1
answer
Votes: 0 Views: 164

BUILD FAILED PackagingResults:Error: Error Unknown Cook Failure RESOLVED

Section: Packaging & Deployment
Product Version: UE 4.15
Comment Mar 30 '17 at 08:38 PM
1
answer
Votes: 0 Views: 29

"Failed to CodeSign" when launching on iPhone (iOS 9.1) from Mac (El Capitan). RESOLVED

Section: Packaging & Deployment
Product Version: UE 4.15
Comment Mar 22 '17 at 07:51 PM
2
answers
Votes: 1 Views: 351

Windows Kits errors preventing build RESOLVED

Section: Everything Else
Product Version: Not Selected
Comment Mar 03 '17 at 03:01 PM
1
answer
Votes: 0 Views: 36

Game dont Build with Plugins RESOLVED

Section: Packaging & Deployment
Product Version: UE 4.14
Answer Mar 01 '17 at 07:44 PM
1
answer
Votes: 0 Views: 35

Unable to package project for windows x64. RESOLVED

Section: Packaging & Deployment
Product Version: UE 4.13
Answer Feb 20 '17 at 04:58 PM
1
answer
Votes: 1 Views: 27

MSB3075 error after adding blueprint accessible variable to c++ base class RESOLVED

Section: C++ Programming
Product Version: UE 4.13
Comment Feb 01 '17 at 06:24 PM
1
answer
Votes: 0 Views: 72

I can't package android project RESOLVED

Section: Packaging & Deployment
Product Version: UE 4.14
Answer Jan 30 '17 at 09:03 PM
1
answer
Votes: 0 Views: 48

Unknown Error RESOLVED

Section: Packaging & Deployment
Product Version: UE 4.14
Answer Jan 15 '17 at 02:44 PM
0
answers
Votes: 0 Views: 63

I can't build anything

Section: Rendering
Product Version: Not Selected
Question Jan 06 '17 at 05:55 PM
1
answer
Votes: 0 Views: 74

ERROR during windows build RESOLVED

Section: Packaging & Deployment
Product Version: UE 4.13
Comment Dec 27 '16 at 03:13 PM
0
answers
Votes: 0 Views: 148

Using libnoise in UE

Section: C++ Programming
Product Version: UE 4.9
Comment Dec 22 '16 at 11:38 AM
1
answer
Votes: 0 Views: 89

Error on package: LogPhysics:Error: PHYSX (..\..\PhysX\src\NpShape.cpp 641) RESOLVED

Section: Packaging & Deployment
Product Version: UE 4.12
Answer Dec 05 '16 at 02:43 PM
AndrewHurley STAFF
1
answer
Votes: 0 Views: 28

How to troubleshoot a Android building error RESOLVED

Section: Packaging & Deployment
Product Version: UE 4.14
Answer Dec 01 '16 at 04:11 PM
1
answer
Votes: 0 Views: 31

Packaging:Error: Error Unknown Cook Failure RESOLVED

Section: Packaging & Deployment
Product Version: UE 4.13
Comment Nov 30 '16 at 07:31 PM
1
answer
Votes: 0 Views: 90

LNK1181 cannot build from source RESOLVED

Section: Installation & Setup
Product Version: UE 4.13
Answer Nov 11 '16 at 11:59 AM
1
answer
Votes: 0 Views: 447

PackagingResults:Error: Error Unknown Cook Failure RESOLVED

Section: Packaging & Deployment
Product Version: UE 4.13
Comment Nov 07 '16 at 11:24 PM
0
answers
Votes: 0 Views: 17

Clean fails?

Section: C++ Programming
Product Version: UE 4.13
Question Nov 04 '16 at 12:57 PM
2
answers
Votes: 0 Views: 242

The project could not be compiled. c++

Section: C++ Programming
Product Version: UE 4.13
Answer Oct 29 '16 at 12:48 PM
1
answer
Votes: 0 Views: 40

Packaging problem RESOLVED

Section: Packaging & Deployment
Product Version: Not Selected
Answer Oct 27 '16 at 04:06 PM
1
answer
Votes: 0 Views: 42

Issue with packaging project : LNK1181 RESOLVED

Section: C++ Programming
Product Version: UE 4.13
Answer Oct 10 '16 at 05:27 PM
Sean Flint STAFF
148 questions
159replies
Subscribe to this topic