x

Search in
Sort by:

Question Status:

Search help

  • Simple searches use one or more words. Separate the words with spaces (cat dog) to search cat,dog or both. Separate the words with plus signs (cat +dog) to search for items that may contain cat but must contain dog.
  • You can further refine your search on the search results page, where you can search by keywords, author, topic. These can be combined with each other. Examples
    • cat dog --matches anything with cat,dog or both
    • cat +dog --searches for cat +dog where dog is a mandatory term
    • cat -dog -- searches for cat excluding any result containing dog
    • [cats] —will restrict your search to results with topic named "cats"
    • [cats] [dogs] —will restrict your search to results with both topics, "cats", and "dogs"

Questions in topic: error compile

0
answers
Votes: 0 Views: 6

Errors when Declaring TAssetPtr

Section: C++ Programming
Product Version: UE 4.21
Question Mar 07 '19 at 05:11 PM
1
answer
Votes: 0 Views: 17

Remove "Target[Self]" section from boolean node?

Section: Blueprint Scripting
Product Version: UE 4.21
Answer Mar 04 '19 at 08:26 AM
0
answers
Votes: 0 Views: 18

Compilation error Visual Studio 2017

Section: C++ Programming
Product Version: UE 4.17
Question Jan 08 '19 at 01:12 PM
3
answers
Votes: 0 Views: 1.1k

Error packing my game on android RESOLVED

Section: Bug Reports
Product Version: UE 4.18
Comment Jan 07 '19 at 05:31 AM
0
answers
Votes: 0 Views: 43

Error 'Failed to load package '''. Exiting.

Section: Packaging & Deployment
Product Version: UE 4.20
Question Dec 13 '18 at 12:53 AM
3
answers
Votes: 3 Views: 1.1k

Can't compile after upgrading to 4.17, syntax error in gen.cpp RESOLVED

Section: Bug Reports
Product Version: UE 4.17
Comment Oct 30 '18 at 10:17 PM
3
answers
Votes: 0 Views: 229

Unreal Engine will not open C++ new project on Mac OS

Section: C++ Programming
Product Version: UE 4.18
Answer Oct 30 '18 at 05:49 AM
1
answer
Votes: 0 Views: 50

Error: TSharedPtr of class with multiple parameter constructor RESOLVED

Section: C++ Programming
Product Version: UE 4.20
Answer Oct 15 '18 at 05:48 PM
0
answers
Votes: 0 Views: 120

Can't create new C++ project

Section: C++ Programming
Product Version: UE 4.14
Comment Oct 09 '18 at 02:32 PM
0
answers
Votes: 0 Views: 59

4.20 packaging fail / crashes randomly in editor

Section: Packaging & Deployment
Product Version: UE 4.20
Comment Oct 04 '18 at 07:32 PM
1
answer
Votes: 0 Views: 226

C++ Overlap events don't work RESOLVED

Section: C++ Programming
Product Version: UE 4.19
Comment Jul 31 '18 at 08:37 PM
2
answers
Votes: 0 Views: 182

attachto() does not take 0 arguments

Section: C++ Programming
Product Version: UE 4.16
Answer Jul 11 '18 at 03:15 AM
2
answers
Votes: 0 Views: 52

I am so mad right now... Unreal Engine cannot rebuild my game, what do I do?

Section: Using UE4
Product Version: UE 4.19
Answer Jul 11 '18 at 03:08 AM
2
answers
Votes: 1 Views: 1.3k

Unhandled Exception: EXCEPTION_ACCESS_VIOLATION reading address 0x000004c0

Section: Rendering
Product Version: Epic Games Launcher
Answer Jul 04 '18 at 04:38 PM
0
answers
Votes: 0 Views: 68

Packaging failed error (Output log .txt file included)

Section: Packaging & Deployment
Product Version: UE 4.19
Question May 29 '18 at 11:43 AM
0
answers
Votes: 1 Views: 82

UE4Editor' failed make: *** [UE4Editor] Error 5

Section: Installation & Setup
Product Version: UE 4.19
Question May 25 '18 at 12:47 PM
0
answers
Votes: 0 Views: 31

I have an error when i packaging the project!

Section: Packaging & Deployment
Product Version: UE 4.19
Comment May 20 '18 at 05:15 PM
2
answers
Votes: 0 Views: 603

Error compiling C ++ project RESOLVED CLOSED

Section: C++ Programming
Product Version: UE 4.19
Comment May 01 '18 at 01:08 AM
1
answer
Votes: 0 Views: 202

Bindaction no instance of overload function error [HELP] RESOLVED

Section: C++ Programming
Product Version: UE 4.19
Answer Apr 18 '18 at 04:55 PM
2
answers
Votes: 2 Views: 3.9k

Abstract Method

Section: C++ Programming
Product Version: Not Selected
Answer Apr 09 '18 at 07:31 AM
3
answers
Votes: 4 Views: 12.3k

Disable plugins outside of editor?

Section: Using UE4
Product Version: Not Selected
Answer Feb 23 '18 at 04:02 PM
3
answers
Votes: 0 Views: 1.2k

Cannot include .generated.h but it exists RESOLVED

Section: C++ Programming
Product Version: UE 4.18
Answer Jan 09 '18 at 10:35 AM
1
answer
Votes: 0 Views: 62

Why UE faild to compile C++ project ?

Section: Using UE4
Product Version: UE 4.18
Answer Jan 08 '18 at 09:42 AM
1
answer
Votes: 0 Views: 404

Error during build (error LNK2001 and error LNK2019)

Section: Packaging & Deployment
Product Version: UE 4.16
Answer Dec 26 '17 at 09:01 AM
2
answers
Votes: 1 Views: 545

Error LNK2019

Section: C++ Programming
Product Version: UE 4.12
Answer Nov 21 '17 at 08:55 AM
0
answers
Votes: 0 Views: 75

Hot Reloading Fail for creating an actor class

Section: Bug Reports
Product Version: UE 4.18
Question Nov 04 '17 at 06:36 PM
0
answers
Votes: 0 Views: 362

Linux: error when compiling: Error 5

Section: Linux
Product Version: UE Github Master branch
Question Oct 29 '17 at 04:07 PM
143 questions
177replies
Subscribe to this topic